{"text_format":"1","workbook":"xlsx","n_sheets":12,"sheets":["Prognosunderlag","Administration","Data","Diagram","Blad 1 Totala intäkter","Blad 2 Indata","Blad 3 Inkomstutjämning","Blad 4 Kostnadsutjämning","Blad 5 Inför.- o strukturbidrag","Blad 6 Befolkningsförändringar","Blad 7 Statsbidrag","kommunkoder"],"not_rendered":{"charts":10,"images":0,"macros":1,"external_links":0,"defined_names":34,"comments":2,"pivot_tables":0},"unopened":[],"bounds":{"document_bytes":16777216,"sheet_cells":100000,"rows_first":2000,"rows_last":500,"rows_between":2000,"halvings":0,"cell_chars":16384,"cell_head_chars":4096},"cells_cut":0,"cells_raw":0,"read":"whole","date_system":"1900"}

{"sheet":"Prognosunderlag","index":0,"n_rows":68,"n_cols":10,"rows_kept":68,"cut":false,"hidden":false,"merged":[]}
["Skatter och bidrag 2024-2031",null,{"$f":"'Blad 2 Indata'!A2","v":""},null,null,null,null,null,null,"2024-04-26"]
["24:27","Skriv in kommunens kommunkod i cellen B1"]
["Belopp i tkr",null,{"$f":"'Blad 1 Totala intäkter'!B9","v":2024},{"$f":"'Blad 1 Totala intäkter'!C9","v":2025},{"$f":"'Blad 1 Totala intäkter'!D9","v":2026},{"$f":"'Blad 1 Totala intäkter'!E9","v":2027},{"$f":"'Blad 1 Totala intäkter'!F9","v":2028},{"$f":"'Blad 1 Totala intäkter'!G9","v":2029},{"$f":"'Blad 1 Totala intäkter'!H9","v":2030},{"$f":"'Blad 1 Totala intäkter'!I9","v":2031}]
["Skatteintäkter",null,{"$f":"'Blad 1 Totala intäkter'!B12","v":0},{"$f":"'Blad 1 Totala intäkter'!C12","v":0},{"$f":"'Blad 1 Totala intäkter'!D12","v":0},{"$f":"'Blad 1 Totala intäkter'!E12","v":0},{"$f":"'Blad 1 Totala intäkter'!F12","v":0},{"$f":"'Blad 1 Totala intäkter'!G12","v":0},{"$f":"'Blad 1 Totala intäkter'!H12","v":0},{"$f":"'Blad 1 Totala intäkter'!I12","v":0}]
["Inkomstutjämningsbidrag/-avgift",null,{"$f":"'Blad 1 Totala intäkter'!B14","v":0},{"$f":"'Blad 1 Totala intäkter'!C14","v":0},{"$f":"'Blad 1 Totala intäkter'!D14","v":0},{"$f":"'Blad 1 Totala intäkter'!E14","v":0},{"$f":"'Blad 1 Totala intäkter'!F14","v":0},{"$f":"'Blad 1 Totala intäkter'!G14","v":0},{"$f":"'Blad 1 Totala intäkter'!H14","v":0},{"$f":"'Blad 1 Totala intäkter'!I14","v":0}]
["Kostnadsutjämning",null,{"$f":"'Blad 1 Totala intäkter'!B16","v":0},{"$f":"'Blad 1 Totala intäkter'!C16","v":0},{"$f":"'Blad 1 Totala intäkter'!D16","v":0},{"$f":"'Blad 1 Totala intäkter'!E16","v":0},{"$f":"'Blad 1 Totala intäkter'!F16","v":0},{"$f":"'Blad 1 Totala intäkter'!G16","v":0},{"$f":"'Blad 1 Totala intäkter'!H16","v":0},{"$f":"'Blad 1 Totala intäkter'!I16","v":0}]
["Regleringsbidrag/-avgift",null,{"$f":"'Blad 1 Totala intäkter'!B18","v":0},{"$f":"'Blad 1 Totala intäkter'!C18","v":0},{"$f":"'Blad 1 Totala intäkter'!D18","v":0},{"$f":"'Blad 1 Totala intäkter'!E18","v":0},{"$f":"'Blad 1 Totala intäkter'!F18","v":0},{"$f":"'Blad 1 Totala intäkter'!G18","v":0},{"$f":"'Blad 1 Totala intäkter'!H18","v":0},{"$f":"'Blad 1 Totala intäkter'!I18","v":0}]
["Strukturbidrag",null,{"$f":"'Blad 1 Totala intäkter'!B20","v":0},{"$f":"'Blad 1 Totala intäkter'!C20","v":0},{"$f":"'Blad 1 Totala intäkter'!D20","v":0},{"$f":"'Blad 1 Totala intäkter'!E20","v":0},{"$f":"'Blad 1 Totala intäkter'!F20","v":0},{"$f":"'Blad 1 Totala intäkter'!G20","v":0},{"$f":"'Blad 1 Totala intäkter'!H20","v":0},{"$f":"'Blad 1 Totala intäkter'!I20","v":0}]
["Införandebidrag",null,{"$f":"'Blad 1 Totala intäkter'!B22","v":0},{"$f":"'Blad 1 Totala intäkter'!C22","v":0},{"$f":"'Blad 1 Totala intäkter'!D22","v":0},{"$f":"'Blad 1 Totala intäkter'!E22","v":0},{"$f":"'Blad 1 Totala intäkter'!F22","v":0},{"$f":"'Blad 1 Totala intäkter'!G22","v":0},{"$f":"'Blad 1 Totala intäkter'!H22","v":0},{"$f":"'Blad 1 Totala intäkter'!I22","v":0}]
["LSS-utjämning (inkl införanderegler)",null,{"$f":"'Blad 1 Totala intäkter'!B24","v":0},{"$f":"'Blad 1 Totala intäkter'!C24","v":0},{"$f":"'Blad 1 Totala intäkter'!D24","v":0},{"$f":"'Blad 1 Totala intäkter'!E24","v":0},{"$f":"'Blad 1 Totala intäkter'!F24","v":0},{"$f":"'Blad 1 Totala intäkter'!G24","v":0},{"$f":"'Blad 1 Totala intäkter'!H24","v":0},{"$f":"'Blad 1 Totala intäkter'!I24","v":0}]
["Summa intäkter",null,{"$f":"'Blad 1 Totala intäkter'!B26","v":0},{"$f":"'Blad 1 Totala intäkter'!C26","v":0},{"$f":"'Blad 1 Totala intäkter'!D26","v":0},{"$f":"'Blad 1 Totala intäkter'!E26","v":0},{"$f":"'Blad 1 Totala intäkter'!F26","v":0},{"$f":"'Blad 1 Totala intäkter'!G26","v":0},{"$f":"'Blad 1 Totala intäkter'!H26","v":0},{"$f":"'Blad 1 Totala intäkter'!I26","v":0}]
[{"$f":"'Blad 1 Totala intäkter'!A28","v":"Slutavräkning 2023 korrigering"},null,{"$f":"'Blad 1 Totala intäkter'!B28","v":0},{"$f":"'Blad 1 Totala intäkter'!C28","v":0},{"$f":"'Blad 1 Totala intäkter'!D28","v":0},{"$f":"'Blad 1 Totala intäkter'!E28","v":0},{"$f":"'Blad 1 Totala intäkter'!F28","v":0},{"$f":"'Blad 1 Totala intäkter'!G28","v":0},{"$f":"'Blad 1 Totala intäkter'!H28","v":0},{"$f":"'Blad 1 Totala intäkter'!I28","v":0}]
[{"$f":"'Blad 1 Totala intäkter'!A30","v":"Slutavräkning 2024"},null,{"$f":"'Blad 1 Totala intäkter'!B30","v":0},{"$f":"'Blad 1 Totala intäkter'!C30","v":0},{"$f":"'Blad 1 Totala intäkter'!D30","v":0},{"$f":"'Blad 1 Totala intäkter'!E30","v":0},{"$f":"'Blad 1 Totala intäkter'!F30","v":0},{"$f":"'Blad 1 Totala intäkter'!G30","v":0},{"$f":"'Blad 1 Totala intäkter'!H30","v":0},{"$f":"'Blad 1 Totala intäkter'!I30","v":0}]
[{"$f":"'Blad 1 Totala intäkter'!A32","v":"Slutavräkning 2025"},null,{"$f":"'Blad 1 Totala intäkter'!B32","v":0},{"$f":"'Blad 1 Totala intäkter'!C32","v":0},{"$f":"'Blad 1 Totala intäkter'!D32","v":0},{"$f":"'Blad 1 Totala intäkter'!E32","v":0},{"$f":"'Blad 1 Totala intäkter'!F32","v":0},{"$f":"'Blad 1 Totala intäkter'!G32","v":0},{"$f":"'Blad 1 Totala intäkter'!H32","v":0},{"$f":"'Blad 1 Totala intäkter'!I32","v":0}]
["Fastighetsavgift",null,{"$f":"'Blad 1 Totala intäkter'!B34","v":0},{"$f":"'Blad 1 Totala intäkter'!C34","v":0},{"$f":"'Blad 1 Totala intäkter'!D34","v":0},{"$f":"'Blad 1 Totala intäkter'!E34","v":0},{"$f":"'Blad 1 Totala intäkter'!F34","v":0},{"$f":"'Blad 1 Totala intäkter'!G34","v":0},{"$f":"'Blad 1 Totala intäkter'!H34","v":0},{"$f":"'Blad 1 Totala intäkter'!I34","v":0}]
["Summa intäkter (inkl avräkning och fastighetsavgift)",null,{"$f":"'Blad 1 Totala intäkter'!B36","v":0},{"$f":"'Blad 1 Totala intäkter'!C36","v":0},{"$f":"'Blad 1 Totala intäkter'!D36","v":0},{"$f":"'Blad 1 Totala intäkter'!E36","v":0},{"$f":"'Blad 1 Totala intäkter'!F36","v":0},{"$f":"'Blad 1 Totala intäkter'!G36","v":0},{"$f":"'Blad 1 Totala intäkter'!H36","v":0},{"$f":"'Blad 1 Totala intäkter'!I36","v":0}]
[]
["Kronor per invånare",null,{"$f":"C3","v":2024},2025,2026,2027,2028,2029,2030,2031]
["Skatteintäkter",null,{"$f":"'Blad 1 Totala intäkter'!K12","v":0},{"$f":"'Blad 1 Totala intäkter'!L12","v":0},{"$f":"'Blad 1 Totala intäkter'!M12","v":0},{"$f":"'Blad 1 Totala intäkter'!N12","v":0},{"$f":"'Blad 1 Totala intäkter'!O12","v":0},{"$f":"'Blad 1 Totala intäkter'!P12","v":0},{"$f":"'Blad 1 Totala intäkter'!Q12","v":0},{"$f":"'Blad 1 Totala intäkter'!R12","v":0}]
["Inkomstutjämningsbidrag/-avgift",null,{"$f":"'Blad 1 Totala intäkter'!K14","v":0},{"$f":"'Blad 1 Totala intäkter'!L14","v":0},{"$f":"'Blad 1 Totala intäkter'!M14","v":0},{"$f":"'Blad 1 Totala intäkter'!N14","v":0},{"$f":"'Blad 1 Totala intäkter'!O14","v":0},{"$f":"'Blad 1 Totala intäkter'!P14","v":0},{"$f":"'Blad 1 Totala intäkter'!Q14","v":0},{"$f":"'Blad 1 Totala intäkter'!R14","v":0}]
["Kostnadsutjämning",null,{"$f":"'Blad 1 Totala intäkter'!K16","v":0},{"$f":"'Blad 1 Totala intäkter'!L16","v":0},{"$f":"'Blad 1 Totala intäkter'!M16","v":0},{"$f":"'Blad 1 Totala intäkter'!N16","v":0},{"$f":"'Blad 1 Totala intäkter'!O16","v":0},{"$f":"'Blad 1 Totala intäkter'!P16","v":0},{"$f":"'Blad 1 Totala intäkter'!Q16","v":0},{"$f":"'Blad 1 Totala intäkter'!R16","v":0}]
["Regleringsbidrag/-avgift",null,{"$f":"'Blad 1 Totala intäkter'!K18","v":3055.3265526466898},{"$f":"'Blad 1 Totala intäkter'!L18","v":2386.8693565866788},{"$f":"'Blad 1 Totala intäkter'!M18","v":2086.2456796621973},{"$f":"'Blad 1 Totala intäkter'!N18","v":1733.5504368257364},{"$f":"'Blad 1 Totala intäkter'!O18","v":1355.9701321129437},{"$f":"'Blad 1 Totala intäkter'!P18","v":1038.9118269334435},{"$f":"'Blad 1 Totala intäkter'!Q18","v":672.27461693512714},{"$f":"'Blad 1 Totala intäkter'!R18","v":298.98012647399565}]
["Strukturbidrag",null,{"$f":"'Blad 1 Totala intäkter'!K20","v":0},{"$f":"'Blad 1 Totala intäkter'!L20","v":0},{"$f":"'Blad 1 Totala intäkter'!M20","v":0},{"$f":"'Blad 1 Totala intäkter'!N20","v":0},{"$f":"'Blad 1 Totala intäkter'!O20","v":0},{"$f":"'Blad 1 Totala intäkter'!P20","v":0},{"$f":"'Blad 1 Totala intäkter'!Q20","v":0},{"$f":"'Blad 1 Totala intäkter'!R20","v":0}]
["Införandebidrag",null,{"$f":"'Blad 1 Totala intäkter'!K22","v":0},{"$f":"'Blad 1 Totala intäkter'!L22","v":0},{"$f":"'Blad 1 Totala intäkter'!M22","v":0},{"$f":"'Blad 1 Totala intäkter'!N22","v":0},{"$f":"'Blad 1 Totala intäkter'!O22","v":0},{"$f":"'Blad 1 Totala intäkter'!P22","v":0},{"$f":"'Blad 1 Totala intäkter'!Q22","v":0},{"$f":"'Blad 1 Totala intäkter'!R22","v":0}]
["LSS-utjämning (inkl införanderegler)",null,{"$f":"'Blad 1 Totala intäkter'!K24","v":0},{"$f":"'Blad 1 Totala intäkter'!L24","v":0},{"$f":"'Blad 1 Totala intäkter'!M24","v":0},{"$f":"'Blad 1 Totala intäkter'!N24","v":0},{"$f":"'Blad 1 Totala intäkter'!O24","v":0},{"$f":"'Blad 1 Totala intäkter'!P24","v":0},{"$f":"'Blad 1 Totala intäkter'!Q24","v":0},{"$f":"'Blad 1 Totala intäkter'!R24","v":0}]
["Summa intäkter",null,{"$f":"'Blad 1 Totala intäkter'!K26","v":3055.3265526466898},{"$f":"'Blad 1 Totala intäkter'!L26","v":2386.8693565866788},{"$f":"'Blad 1 Totala intäkter'!M26","v":2086.2456796621973},{"$f":"'Blad 1 Totala intäkter'!N26","v":1733.5504368257364},{"$f":"'Blad 1 Totala intäkter'!O26","v":1355.9701321129437},{"$f":"'Blad 1 Totala intäkter'!P26","v":1038.9118269334435},{"$f":"'Blad 1 Totala intäkter'!Q26","v":672.27461693512714},{"$f":"'Blad 1 Totala intäkter'!R26","v":298.98012647399565}]
[{"$f":"A12","v":"Slutavräkning 2023 korrigering"},null,{"$f":"'Blad 1 Totala intäkter'!K28","v":-87},{"$f":"'Blad 1 Totala intäkter'!L28","v":0},{"$f":"'Blad 1 Totala intäkter'!M28","v":0},{"$f":"'Blad 1 Totala intäkter'!N28","v":0},{"$f":"'Blad 1 Totala intäkter'!O28","v":0},{"$f":"'Blad 1 Totala intäkter'!P28","v":0},{"$f":"'Blad 1 Totala intäkter'!Q28","v":0},{"$f":"'Blad 1 Totala intäkter'!R28","v":0}]
[{"$f":"A13","v":"Slutavräkning 2024"},null,{"$f":"'Blad 1 Totala intäkter'!K30","v":20},{"$f":"'Blad 1 Totala intäkter'!L30","v":0},{"$f":"'Blad 1 Totala intäkter'!M30","v":0},{"$f":"'Blad 1 Totala intäkter'!N30","v":0},{"$f":"'Blad 1 Totala intäkter'!O30","v":0},{"$f":"'Blad 1 Totala intäkter'!P30","v":0},{"$f":"'Blad 1 Totala intäkter'!Q30","v":0},{"$f":"'Blad 1 Totala intäkter'!R30","v":0}]
[{"$f":"A14","v":"Slutavräkning 2025"},null,{"$f":"'Blad 1 Totala intäkter'!K32","v":0},{"$f":"'Blad 1 Totala intäkter'!L32","v":0},{"$f":"'Blad 1 Totala intäkter'!M32","v":0},{"$f":"'Blad 1 Totala intäkter'!N32","v":0},{"$f":"'Blad 1 Totala intäkter'!O32","v":0},{"$f":"'Blad 1 Totala intäkter'!P32","v":0},{"$f":"'Blad 1 Totala intäkter'!Q32","v":0},{"$f":"'Blad 1 Totala intäkter'!R32","v":0}]
["Fastighetsavgift",null,{"$f":"'Blad 1 Totala intäkter'!K34","v":{"$error":"#DIV/0!"}},{"$f":"'Blad 1 Totala intäkter'!L34","v":{"$error":"#DIV/0!"}},{"$f":"'Blad 1 Totala intäkter'!M34","v":{"$error":"#DIV/0!"}},{"$f":"'Blad 1 Totala intäkter'!N34","v":{"$error":"#DIV/0!"}},{"$f":"'Blad 1 Totala intäkter'!O34","v":{"$error":"#DIV/0!"}},{"$f":"'Blad 1 Totala intäkter'!P34","v":{"$error":"#DIV/0!"}},{"$f":"'Blad 1 Totala intäkter'!Q34","v":{"$error":"#DIV/0!"}},{"$f":"'Blad 1 Totala intäkter'!R34","v":{"$error":"#DIV/0!"}}]
["Summa intäkter (inkl avräkning och fastighetsavgift)",null,{"$f":"'Blad 1 Totala intäkter'!K36","v":{"$error":"#DIV/0!"}},{"$f":"'Blad 1 Totala intäkter'!L36","v":{"$error":"#DIV/0!"}},{"$f":"'Blad 1 Totala intäkter'!M36","v":{"$error":"#DIV/0!"}},{"$f":"'Blad 1 Totala intäkter'!N36","v":{"$error":"#DIV/0!"}},{"$f":"'Blad 1 Totala intäkter'!O36","v":{"$error":"#DIV/0!"}},{"$f":"'Blad 1 Totala intäkter'!P36","v":{"$error":"#DIV/0!"}},{"$f":"'Blad 1 Totala intäkter'!Q36","v":{"$error":"#DIV/0!"}},{"$f":"'Blad 1 Totala intäkter'!R36","v":{"$error":"#DIV/0!"}}]
[]
["Basuppgifter",{"$f":"'Blad 2 Indata'!B3","v":2023},{"$f":"'Blad 2 Indata'!C3","v":2024},{"$f":"'Blad 2 Indata'!D3","v":2025},{"$f":"'Blad 2 Indata'!E3","v":2026},{"$f":"'Blad 2 Indata'!F3","v":2027},{"$f":"'Blad 2 Indata'!G3","v":2028},{"$f":"'Blad 2 Indata'!H3","v":2029},{"$f":"'Blad 2 Indata'!I3","v":2030},{"$f":"'Blad 2 Indata'!J3","v":2031}]
["Uppräkningsfaktorer"]
[{"$f":"'Blad 2 Indata'!A7","v":"Fastställt för 2024"},{"$f":"'Blad 2 Indata'!B7","v":4.5999999999999996},{"$f":"'Blad 2 Indata'!C7","v":3.3},null," "]
[{"$f":"'Blad 2 Indata'!A8","v":"Fastställt för 2025"},null,{"$f":"'Blad 2 Indata'!C8","v":0},{"$f":"'Blad 2 Indata'!D8","v":0}]
["Sveriges Kommuner och Regioners prognos",{"$f":"'Blad 2 Indata'!B9","v":5.0943595873486291},{"$f":"'Blad 2 Indata'!C9","v":2.8500526395127901},{"$f":"'Blad 2 Indata'!D9","v":4.758554999090614},{"$f":"'Blad 2 Indata'!E9","v":4.1273943366828991},{"$f":"'Blad 2 Indata'!F9","v":4.0119628964820242},{"$f":"'Blad 2 Indata'!G9","v":4.0813872004546337},{"$f":"'Blad 2 Indata'!H9","v":3.3005944829045397},{"$f":"'Blad 2 Indata'!I9","v":3.7130154970406171},{"$f":"'Blad 2 Indata'!J9","v":3.6633313430403325}]
[]
["Antal invånare den 1.11 året innan"]
["Antal invånare i riket ",{"$f":"'Blad 2 Indata'!B26","v":10514719},{"$f":"'Blad 2 Indata'!C26","v":10557682},{"$f":"'Blad 2 Indata'!D26","v":10583710},{"$f":"'Blad 2 Indata'!E26","v":10608314},{"$f":"'Blad 2 Indata'!F26","v":10632043},{"$f":"'Blad 2 Indata'!G26","v":10654520},{"$f":"'Blad 2 Indata'!H26","v":10677603},{"$f":"'Blad 2 Indata'!I26","v":10701190},{"$f":"'Blad 2 Indata'!J26","v":10725525}]
["Förändring i riket i procent",null,null,{"$f":"'Blad 2 Indata'!D25","v":0.24653138823465226},{"$f":"'Blad 2 Indata'!E25","v":0.23247046640544763},{"$f":"'Blad 2 Indata'!F25","v":0.2236830470892924},{"$f":"'Blad 2 Indata'!G25","v":0.21140809908312069},{"$f":"'Blad 2 Indata'!H25","v":0.2166498349996058},{"$f":"'Blad 2 Indata'!I25","v":0.22090163869175508},{"$f":"'Blad 2 Indata'!J25","v":0.227404615748342}]
["Antal invånare i kommunen enligt riksprognos",{"$f":"'Blad 2 Indata'!B29","v":0},{"$f":"'Blad 2 Indata'!C29","v":0},{"$f":"'Blad 2 Indata'!D29","v":0},{"$f":"'Blad 2 Indata'!E29","v":0},{"$f":"'Blad 2 Indata'!F29","v":0},{"$f":"'Blad 2 Indata'!G29","v":0},{"$f":"'Blad 2 Indata'!H29","v":0},{"$f":"'Blad 2 Indata'!I29","v":0},{"$f":"'Blad 2 Indata'!J29","v":0}]
[]
[{"$f":"'Blad 2 Indata'!A18","v":"Skatteunderlag inkomstår 2022 och 2023"}]
["Riket, miljoner kr",{"$f":"'Blad 2 Indata'!B19","v":2645513.4868999999},{"$f":"'Blad 2 Indata'!C19","v":0}]
["Kommunen, tkr",{"$f":"'Blad 2 Indata'!B20","v":0},{"$f":"'Blad 2 Indata'!C20","v":0}]
[]
["Skattesatser"]
["Kommunens skattesats",null,{"$f":"'Blad 2 Indata'!C60","v":0},{"$f":"'Blad 2 Indata'!D60","v":0},{"$f":"'Blad 2 Indata'!E60","v":0},{"$f":"'Blad 2 Indata'!F60","v":0},{"$f":"'Blad 2 Indata'!G60","v":0},{"$f":"'Blad 2 Indata'!H60","v":0},{"$f":"'Blad 2 Indata'!I60","v":0},{"$f":"'Blad 2 Indata'!J60","v":0}]
["Länsvis skattesats avgift 85%/bidrag 95%",null,{"$f":"'Blad 3 Inkomstutjämning'!C37","v":0},{"$f":"'Blad 3 Inkomstutjämning'!D37","v":0},{"$f":"'Blad 3 Inkomstutjämning'!E37","v":0},{"$f":"'Blad 3 Inkomstutjämning'!F37","v":0},{"$f":"'Blad 3 Inkomstutjämning'!G37","v":0},{"$f":"'Blad 3 Inkomstutjämning'!H37","v":0},{"$f":"'Blad 3 Inkomstutjämning'!I37","v":0},{"$f":"'Blad 3 Inkomstutjämning'!J37","v":0}]
[]
["Inkomstutjämning"]
["Medelskattekraft i riket, fastställd",{"$f":"'Blad 3 Inkomstutjämning'!B16","v":260928},{"$f":"'Blad 3 Inkomstutjämning'!C16","v":270753},{"$f":"'Blad 3 Inkomstutjämning'!D16","v":0}]
["Medelskattekraft i riket, prognos",{"$f":"'Blad 3 Inkomstutjämning'!B17","v":264418},{"$f":"'Blad 3 Inkomstutjämning'!C17","v":270848},{"$f":"'Blad 3 Inkomstutjämning'!D17","v":283038},{"$f":"'Blad 3 Inkomstutjämning'!E17","v":294037},{"$f":"'Blad 3 Inkomstutjämning'!F17","v":305151},{"$f":"'Blad 3 Inkomstutjämning'!G17","v":316935},{"$f":"'Blad 3 Inkomstutjämning'!H17","v":326688},{"$f":"'Blad 3 Inkomstutjämning'!I17","v":338072},{"$f":"'Blad 3 Inkomstutjämning'!J17","v":349661}]
["Garanterad skattekraft, riket",null,{"$f":"'Blad 3 Inkomstutjämning'!C19","v":311365.94999999995},{"$f":"'Blad 3 Inkomstutjämning'!D19","v":325493.69999999995},{"$f":"'Blad 3 Inkomstutjämning'!E19","v":338142.55},{"$f":"'Blad 3 Inkomstutjämning'!F19","v":350923.64999999997},{"$f":"'Blad 3 Inkomstutjämning'!G19","v":364475.25},{"$f":"'Blad 3 Inkomstutjämning'!H19","v":375691.19999999995},{"$f":"'Blad 3 Inkomstutjämning'!I19","v":388782.8},{"$f":"'Blad 3 Inkomstutjämning'!J19","v":402110.14999999997}]
["Uppräknat skatteunderlag kommunen, tkr",null,{"$f":"'Blad 3 Inkomstutjämning'!C24","v":0},{"$f":"'Blad 3 Inkomstutjämning'!D24","v":0},{"$f":"'Blad 3 Inkomstutjämning'!E24","v":0},{"$f":"'Blad 3 Inkomstutjämning'!F24","v":0},{"$f":"'Blad 3 Inkomstutjämning'!G24","v":0},{"$f":"'Blad 3 Inkomstutjämning'!H24","v":0},{"$f":"'Blad 3 Inkomstutjämning'!I24","v":0},{"$f":"'Blad 3 Inkomstutjämning'!J24","v":0}]
["Garanterat skatteunderlag, tkr",null,{"$f":"'Blad 3 Inkomstutjämning'!C27","v":0},{"$f":"'Blad 3 Inkomstutjämning'!D27","v":0},{"$f":"'Blad 3 Inkomstutjämning'!E27","v":0},{"$f":"'Blad 3 Inkomstutjämning'!F27","v":0},{"$f":"'Blad 3 Inkomstutjämning'!G27","v":0},{"$f":"'Blad 3 Inkomstutjämning'!H27","v":0},{"$f":"'Blad 3 Inkomstutjämning'!I27","v":0},{"$f":"'Blad 3 Inkomstutjämning'!J27","v":0}]
["Underlag för inkomstutjämning",null,{"$f":"'Blad 3 Inkomstutjämning'!C30","v":0},{"$f":"'Blad 3 Inkomstutjämning'!D30","v":0},{"$f":"'Blad 3 Inkomstutjämning'!E30","v":0},{"$f":"'Blad 3 Inkomstutjämning'!F30","v":0},{"$f":"'Blad 3 Inkomstutjämning'!G30","v":0},{"$f":"'Blad 3 Inkomstutjämning'!H30","v":0},{"$f":"'Blad 3 Inkomstutjämning'!I30","v":0},{"$f":"'Blad 3 Inkomstutjämning'!J30","v":0}]
[]
["Regleringsbidrag/avgift "]
["Anslag kommunalek. utj.",{"$f":"'Blad 2 Indata'!B32","v":108030.82600000002},{"$f":"'Blad 2 Indata'!C32","v":119175.95600000001},{"$f":"'Blad 2 Indata'!D32","v":116402.95600000001},{"$f":"'Blad 2 Indata'!E32","v":116993.95600000001},{"$f":"'Blad 2 Indata'!F32","v":117058.95600000001},{"$f":"'Blad 2 Indata'!G32","v":117058.95600000001},{"$f":"'Blad 2 Indata'!H32","v":117058.95600000001},{"$f":"'Blad 2 Indata'!I32","v":117058.95600000001},{"$f":"'Blad 2 Indata'!J32","v":117058.95600000001}]
["Inkomstutjämningsbidrag, netto",{"$f":"'Blad 2 Indata'!B36","v":82467.959067000003},{"$f":"'Blad 2 Indata'!C36","v":85973.155518},{"$f":"'Blad 2 Indata'!D36","v":90095.989346000002},{"$f":"'Blad 2 Indata'!E36","v":93814.949794},{"$f":"'Blad 2 Indata'!F36","v":97577.972760999997},{"$f":"'Blad 2 Indata'!G36","v":101559.721298},{"$f":"'Blad 2 Indata'!H36","v":104911.564764},{"$f":"'Blad 2 Indata'!I36","v":108808.183108},{"$f":"'Blad 2 Indata'!J36","v":112793.200165}]
["Kostnadsutjämning, netto",{"$f":"'Blad 2 Indata'!B40","v":-71.761028000000806},{"$f":"'Blad 2 Indata'!C40","v":-96.831093000000692},{"$f":"'Blad 2 Indata'!D40","v":0},{"$f":"'Blad 2 Indata'!E40","v":0},{"$f":"'Blad 2 Indata'!F40","v":0},{"$f":"'Blad 2 Indata'!G40","v":0},{"$f":"'Blad 2 Indata'!H40","v":0},{"$f":"'Blad 2 Indata'!I40","v":0},{"$f":"'Blad 2 Indata'!J40","v":0}]
["Strukturbidrag",{"$f":"'Blad 2 Indata'!B43","v":1046.5177679999999},{"$f":"'Blad 2 Indata'!C43","v":1042.465426},{"$f":"'Blad 2 Indata'!D43","v":1045.033576},{"$f":"'Blad 2 Indata'!E43","v":1047.4569550000001},{"$f":"'Blad 2 Indata'!F43","v":1049.800452},{"$f":"'Blad 2 Indata'!G43","v":1052.0238099999999},{"$f":"'Blad 2 Indata'!H43","v":1054.3031960000001},{"$f":"'Blad 2 Indata'!I43","v":1056.6344839999999},{"$f":"'Blad 2 Indata'!J43","v":1059.037014}]
["Införandebidrag",{"$f":"'Blad 2 Indata'!B46","v":27.756599000000001},{"$f":"'Blad 2 Indata'!C46","v":0},{"$f":"'Blad 2 Indata'!D46","v":0},{"$f":"'Blad 2 Indata'!E46","v":0},{"$f":"'Blad 2 Indata'!F46","v":0},{"$f":"'Blad 2 Indata'!G46","v":0},{"$f":"'Blad 2 Indata'!H46","v":0},{"$f":"'Blad 2 Indata'!I46","v":0},{"$f":"'Blad 2 Indata'!J46","v":0}]
["Regleringsbidrag/avgift"]
["Miljoner kronor",{"$f":"'Blad 2 Indata'!B49","v":24560.353594},{"$f":"'Blad 2 Indata'!C49","v":32257.166149000012},{"$f":"'Blad 2 Indata'!D49","v":25261.933078000002},{"$f":"'Blad 2 Indata'!E49","v":22131.549251000004},{"$f":"'Blad 2 Indata'!F49","v":18431.182787000012},{"$f":"'Blad 2 Indata'!G49","v":14447.210892000003},{"$f":"'Blad 2 Indata'!H49","v":11093.088040000017},{"$f":"'Blad 2 Indata'!I49","v":7194.1384080000134},{"$f":"'Blad 2 Indata'!J49","v":3206.7188210000022}]
["Kronor per invånare",{"$f":"'Blad 2 Indata'!B50","v":2335.8069382548406},{"$f":"'Blad 2 Indata'!C50","v":3055.3265526466898},{"$f":"'Blad 2 Indata'!D50","v":2386.8693565866788},{"$f":"'Blad 2 Indata'!E50","v":2086.2456796621973},{"$f":"'Blad 2 Indata'!F50","v":1733.5504368257364},{"$f":"'Blad 2 Indata'!G50","v":1355.9701321129437},{"$f":"'Blad 2 Indata'!H50","v":1038.9118269334435},{"$f":"'Blad 2 Indata'!I50","v":672.27461693512714},{"$f":"'Blad 2 Indata'!J50","v":298.98012647399565}]

{"sheet":"Administration","index":1,"n_rows":31,"n_cols":3,"rows_kept":31,"cut":false,"hidden":true,"merged":[]}
[]
["Datum för senaste dataöverföring"]
["2024-04-26T10:03:41"]
["Finlnamn senaste överföringen"]
["G:\\Avd ekonomi & styrning\\EkAnalys\\Gemens_kataloger_EkAnalys\\Finspec\\Modellen Skatter och bidrag\\2024\\Kommuner\\Uppdateringsfiler\\Uppdateringsfil-24027nr2.xlsm"]
[]
["Från cirkulär","Datum","Denna lista fylls på automatiskt varje gång du uppdaterar"]
["00:00","2024-01-17","Data"]
["24:16","2024-02-26","Slutavräkning 2023 korrigering (Blad 1, K28)"]
[null,null,"Slutavräkning 2024 (Blad 1,K30)"]
[null,null,"Skatteunderlagsprognos (B9-J9)"]
[null,null,"Inkomstutjämningsbidrag netto (D36-J36)"]
[null,null,"Konsumentprisindex (B56-J56)"]
[null,null,"Prisindex för kommunal verksamhet, PKV (B99-J101)"]
[null,null,"Justering av statsbidrag pga skatteväxling"]
[null,null,"Befolkningsuppgifter kommun per 31/12 2023 (C71-C79)"]
[null,null,"Befolkningsuppgifter riket per 31/12 2023 (Blad 4, C71-C79)"]
["24:27","2024-04-26","Slutavräkning 2023, korrigering (Blad 1, K28)"]
[null,null,"Slutavräkning 2024 (Blad 1, K30)"]
[null,null,"Skatteunderlagsprognos (B9-J9)"]
[null,null,"Befolkningsprognos riket (D26-J26)"]
[null,null,"Kommunvis befolkningsframskrivning (D29-J29)"]
[null,null,"Inkomstutjämningsbidrag netto (D36-J36)"]
[null,null,"Strukturbidrag (D43-J43)"]
[null,null,"Konsumentprisindex (B56-J56)"]
[null,null,"Preliminär kostnadsutjämning 2025 (D65)"]
[null,null,"LSS-utjämning 2024 reviderat utfall (C68)"]
[null,null,"Preliminär LSS-utjämning 2025 (D68)"]
[null,null,"Prisindex för kommunal verksamhet, PKV (B99-J101)"]
[null,null,"Prislappar prel kostnadsutjämning 2025 (Blad 4, C57-I64)"]
[null,null,"Befolkningsprognos riket, åldersgrupper (Blad 4, D71-I79)"]

{"sheet":"Data","index":2,"n_rows":294,"n_cols":137,"rows_kept":294,"cut":false,"hidden":true,"merged":[]}
[1,2,3,4,5,6,7,8,9,10,11,12,13,14,15,16,17,18,19,20,21,22,23,24,25,26,27,28,29,30,31,32,33,34,35,36,37,38,39,40,41,42,43,44,45,46,47,48,49,50,51,52,53,54,55,56,57,58,59,60,61,62,63,64,65,66,67,68,69,70,71,72,73,74,75,76,77,78,79,80,81,82,83,84,85,86,87,88,89,90,91,92,93,94,95,96,97,98,99,100,101,102,103,104,105,106,107,108,109,110,111,112,113,114,115,116,117,118,119,120,121,122,123,124,125,126,127,128,129,130,131,132,133,134,135,136,137]
["Kommunkod","Kommun","Beskattningsutfall inkomstår 22","Beskattningsutfall inkomstår 23","Inv 1 november 22","Inv 1 november 23","Inv 1 november 24","Inv 1 november 25","Inv 1 november 26","Inv 1 november 27","Utdeb 23","Utdeb 24","Utdeb 25","Länsvis utdeb 95% 2024","Länsvis utdeb 85% 2024",null,"Kostnadsutjämning 24","Kostnadsutjämning 25","LSS-utjämning 24","LSS-utjämning 25","Totalt 31 dec 2022 (1 januari 23)","Totalt 31 dec 2023 (1 januari 24)","1-5 år 23 (=31 dec 2022)","6-12 år 23 (=31 dec 2022)","6 år 23 (=31 dec 2022)","7-15 år 23 (=31 dec 2022)","16-18 år 23 (=31 dec 2022)","65-79 år 23 (=31 dec 2022)","80-89 år 23 (=31 dec 2022)","90- år 23 (=31 dec 2022)","1-5 år 24 (=31 dec 2023)","6-12 år 24 (=31 dec 2023)","6 år 24 (=31 dec 2023)","7-15 år 24 (=31 dec 2023)","16-18 år 24 (=31 dec 2023)","65-79 år 24 (=31 dec 2023)","80-89 år 24 (=31 dec 2023)","90- år 24 (=31 dec 2023)","Totalt 31 dec 12","Totalt 31 dec 13","Totalt 31 dec 14","Totalt 31 dec 15","Totalt 31 dec 16","Totalt 31 dec 17","Totalt 31 dec 17","Totalt 31 dec 18","Totalt 31 dec 19","Totalt 31 dec 20","Totalt 31 dec 21","Totalt 31 dec 22","6-15 år 31 dec 17","6-15 år 31 dec 18","6-15 år 31 dec 19","6-15 år 31 dec 20","6-15 år 31 dec 21","6-15 år 31 dec 22","1-5 år 31 dec 2017","1-5 år 31 dec 2018","1-5 år 31 dec 2019","1-5 år 31 dec 2020","1-5 år 31 dec 2021","1-5 år 31 dec 2022","Inv 1 november 18","Inv 1 november 19","Inv 1 november 20","Inv 1 november 21","Inv 1 november 22","Kolumnerna till höger är prislapparna i kostutj","1-5 år 24","6-12 år 24","6 år 24","7-15 år 24","16-18 år 24","65-79 år 24","80-89 år 24","90- år 24","Eftersläpningsersättning 2024","1-5 år prel 25","6-12 år prel 25","6 år prel 25","7-15 år prel 25","16-18 år prel 25","65-79 år prel 25","80-89 år prel 25","90- år prel 25","Länsvis utdeb 95% 2025","Länsvis utdeb 85% 2025","Fastighetsavgift 09-23 prognos ökn tkr","Fastighetsavgift 24 prognos ökning tkr","Fastighetsavgift 25 prognos ökning tkr","Fastighetsavgift 26 prognos ökning tkr","Inv 1 november 07","16-18 år 31 dec 17","16-18 år 31 dec 18","16-18 år 31 dec 19","16-18 år 31 dec 20","16-18 år 31 dec 21","16-18 år 31 dec 22",null,"strukturbidrag","Kostnadsutjämn ev nytt införandebidrag 2023","Kostnadsutjämn ev nytt införandebidrag 2024","Kostnadsutjämn ev nytt införandebidrag 2025","Kostnadsutjämn ev nytt införandebidrag 2026","Kostnadsutjämn ev nytt införandebidrag 2027","Kostnadsutjämn ev nytt införandebidrag 2028","Kostnadsutjämn ev nytt införandebidrag 2029","Justering anslag 2023 vid värdesäkring se cell DE109"]
[114,"Upplands Väsby",12197331.6,null,48973,50209,50333,50450,50563,50670,19.420000000000002,19.420000000000002,null,19.05,16.98,null,2574,2212,-43.2636356347139,-292.64756408683388,49262,50110,3184,4538,680,5685,1746,5853,1880,315,3121,4666,696,5814,1846,5805,2040,341,40723,41449,41816,42661,43891,44605,44605,45543,46786,47184,47820,49262,5538,5684,5847,6075,6184,6365,2973,3066,3148,3086,3046,3184,45332,46510,47194,47573,48973,null,146631.59947843483,23105.115202700479,70361.734488949602,127911.92580598241,133585.2276004875,24725.826059999999,131565.17009999999,339935.74705999997,814,152752.09390623562,23441.083498308239,72514.658813731643,130841.65448945508,133162.94606697545,25042.055768999995,132662.56703399998,342156.2835689999,19.05,16.98,28066.377349268525,1959.5360000000001,3857.942,null,38027,1515,1588,1645,1645,1714,1746,null,0,0]
[115,"Vallentuna",9925039.8000000007,null,34760,35078,35164,35246,35325,35400,18.899999999999999,18.899999999999999,null,19.05,16.98,null,2014,1441,-141.93700474501,-242.05272796698773,34851,35076,2053,3655,469,4731,1520,4033,1359,230,1981,3533,455,4661,1520,4022,1498,215,31215,31616,31969,32380,32785,33175,33175,33432,34090,34119,34246,34851,4998,5070,5196,5183,5179,5200,2362,2268,2238,2139,2056,2053,33280,34040,34127,34256,34760,null,144425.89046459814,24829.214037235284,71191.629317186162,126318.35473190869,133985.79748288248,22758.689719999998,125086.79247999999,335587.79877999995,0,150389.96630446895,25186.416812732066,73342.558238368467,128757.73055040509,133658.12931231083,23044.256900999993,126090.80558099996,336392.36386199994,19.05,16.98,38424.901375351365,2849.701,4365.6509999999998,null,28249,1239,1326,1380,1437,1470,1520,null,0,0]
[117,"Österåker",14036812.800000001,null,49070,49395,49517,49632,49743,49848,16.899999999999999,16.600000000000001,null,19.05,16.98,null,1169,1358,-743.51773075397796,-814.55245589729384,49138,49282,3111,4612,669,5918,2098,6655,1993,336,3048,4570,641,5907,2056,6552,2226,347,40269,40495,41180,42130,43293,44130,44130,44831,45574,46644,48234,49138,6405,6456,6362,6393,6504,6587,2799,2825,2826,2855,3066,3111,44663,45424,46585,48008,49070,null,143765.57480104381,24017.969798437996,72322.888123733181,128390.83779201408,132962.7302821656,22107.694959999997,125016.03217999999,325818.52289999998,0,149871.89327423021,24369.217586566836,74519.0131039064,130968.46158742593,132462.95516307381,22440.971483999994,125921.55338999997,334338.49371599994,19.05,16.98,68916.816114864851,5495.4579999999996,8495.0969999999998,null,38257,1608,1773,1877,1997,2073,2098,null,0,0]
[120,"Värmdö",13665608.800000001,null,46351,46571,46686,46795,46900,46999,18.98,18.98,null,19.05,16.98,null,94,287,-1558.9884268000901,-1370.6295180767102,46457,46637,2763,4404,646,5673,1961,6526,1614,280,2695,4354,605,5619,2014,6621,1809,307,39387,39784,40541,41107,42000,43444,43444,44397,45000,45566,46232,46457,6396,6439,6399,6396,6396,6319,2895,2888,2859,2775,2835,2763,44210,44928,45393,46174,46351,null,143261.75952155003,24270.743182961083,72118.847191224209,126944.20599079845,135361.16475903513,23231.150799999999,129378.13251999998,343019.80751999997,0,149308.16801638436,24624.261632538182,74301.920570499613,129504.26692318123,134305.43513568855,23576.934041999993,127417.82582699996,337332.07694699994,19.05,16.98,96686.697556298823,7729.1480000000001,12210.049000000001,null,36672,1611,1720,1851,1920,1902,1961,null,0,0]
[123,"Järfälla",21729867.100000001,null,84962,86143,86355,86556,86750,86933,18.989999999999998,19.239999999999998,null,19.05,16.98,null,1447,1486,-767.98787402370999,-977.0297633604805,85460,86330,5342,7644,1101,9746,3214,9702,3288,648,5336,7614,1076,9817,3236,9676,3478,673,68210,69167,70701,72429,74412,76453,76453,78480,79990,81274,83170,85460,9894,10135,10389,10481,10727,10847,5106,5271,5211,5339,5331,5342,78070,79907,81034,82841,84962,null,146033.6204368727,23873.66105995416,69991.681323247351,127302.4621596147,133384.01770431467,24326.302519999997,129031.95135999999,337656.17677999998,117,152338.44776672142,24225.504347962855,72122.325785202454,130098.54997411587,131487.94255681112,24664.093820999995,129603.56731199997,341418.01174199994,19.05,16.98,49324.073986480653,3363.1970000000001,6678.6689999999999,null,63229,2674,2785,2903,2984,3068,3214,null,0,0]
[125,"Ekerö",9209881.3000000007,null,29135,28866,28937,29004,29069,29130,18.95,19.22,null,19.05,16.98,null,4822,5425,768.29770640268498,853.28351163363914,29123,28808,1811,3198,437,4256,1319,3718,1205,203,1727,3119,423,4153,1396,3760,1311,207,26160,26355,26698,26984,27406,27753,27753,28308,28690,28879,29096,29123,4588,4651,4670,4713,4726,4693,1924,1918,1880,1860,1856,1811,28232,28594,28861,29059,29135,null,144693.74677010911,24811.438896742933,72270.417674132608,127875.92587425483,134006.96182305057,21624.347679999999,122204.12671999999,335761.97797999997,0,150733.24325413763,25170.912433451453,74463.760455606011,130485.34148015374,134387.26832973809,21951.905336999997,123546.83093099997,335296.89722699992,19.05,16.98,43616.959407391616,3016.107,4957.6970000000001,null,24634,1052,1169,1262,1280,1307,1319,null,0,0]
[126,"Huddinge",30280730.600000001,null,114308,114118,114399,114665,114921,115164,19.47,19.47,null,19.05,16.98,null,2103,2001,-1405.2525833791899,-1535.9642252555404,114504,113920,7058,11393,1559,14697,4643,11927,3381,672,6826,11044,1455,14520,4661,12066,3595,692,101010,102557,104185,105311,107538,110003,110003,111722,112848,113234,113951,114504,15588,15950,16230,16264,16246,16256,7856,7724,7507,7300,7263,7058,111415,112815,113055,113843,114308,null,146023.04443811078,24126.363467562074,70347.530719471484,127113.09615547137,132282.24084935538,24779.168439999998,131272.33132,340099.04005999997,0,152182.5321048614,24477.44146994378,72481.720017268279,129646.69292963794,130871.14620427451,24980.792705999993,131869.26228599998,342155.24521199992,19.05,16.98,85911.204215715159,5837.1319999999996,10814.482,null,91391,4047,4095,4223,4399,4531,4643,null,0,0]
[127,"Botkyrka",21005690.399999999,null,95238,95514,95749,95972,96187,96390,20.149999999999999,20.149999999999999,null,19.05,16.98,null,3374,3375,431.752082795386,602.71553486299581,95383,95592,5878,9142,1228,11819,3719,10463,2818,481,5624,9006,1233,11831,3790,10473,3068,501,86274,87580,88901,89425,90675,91925,91925,93106,94606,94847,95318,95383,12246,12598,12870,13054,13242,13047,6447,6444,6396,6139,6000,5878,92723,94247,94843,95011,95238,null,145369.8057261772,21663.949359648417,69586.089374577088,128236.42228064522,135781.18501132511,25208.084719999999,132341.35616,336422.77031999995,0,151359.21257890368,21976.230930486076,71705.039557615164,130914.22031029996,133805.7262611074,25537.352057999993,131685.47309699998,337649.81418899994,19.05,16.98,59080.816698481234,4226.6909999999998,7714.14,null,78682,3394,3471,3550,3643,3713,3719,null,0,0]
[128,"Salem",4528960.8,null,17310,17435,17478,17519,17558,17595,19.420000000000002,19.670000000000002,null,19.05,16.98,null,4919,4543,-57.408086870014799,-521.57128208161339,17352,17451,1119,1785,228,2404,825,2040,840,125,1086,1760,235,2324,853,2001,898,122,15881,16001,16140,16426,16615,16665,16665,16786,16750,16959,17252,17352,2610,2624,2616,2632,2653,2632,1082,1081,1108,1106,1100,1119,16778,16765,16879,17159,17310,null,143146.62220180058,23930.79488460382,69547.420230307922,125166.41839954117,132389.52417480113,21676.601439999999,123778.27123999999,332952.24975999998,0,149129.2384672339,24277.716855328199,71638.016997543775,127474.94928755438,133907.44877808134,22108.697243999995,124892.54160299998,330514.22488499992,19.05,16.98,15965.746556759261,976.68100000000004,1952.2349999999999,null,14991,714,723,718,744,788,825,null,0,0]
[136,"Haninge",23429989.5,null,97444,99531,99776,100008,100232,100444,19.68,19.68,null,19.05,16.98,null,2190,1434,-1166.4725058711099,-1162.1215680608211,97683,99751,6634,9122,1328,11457,3525,10753,3208,478,6589,9090,1322,11617,3647,10722,3446,514,79430,80932,82407,83866,85693,88037,88037,89989,92095,93690,95658,97683,11389,11659,11931,12275,12555,12785,6011,6238,6452,6533,6609,6634,89684,91500,93370,95421,97444,null,143885.53576493365,21781.593928624545,70200.699889149866,126585.61631216967,140353.47995631429,25075.273079999999,132519.88983999999,341190.92591999995,579,149957.58028354016,22099.356017380745,72331.965360000046,129188.80008185237,138863.47336581917,25346.294369999992,131439.38248799997,344274.5318489999,19.05,16.98,82124.06657378035,6452.7870000000003,10659.098,null,73557,3075,3102,3224,3304,3377,3525,null,0,0]
[138,"Tyresö",14165078.6,null,49213,49215,49336,49451,49562,49667,19.5,19.5,null,19.05,16.98,null,2794,2893,-494.509579037408,-423.68021050347852,49214,49173,2828,4785,662,6369,2182,5792,2147,414,2712,4683,587,6311,2190,5705,2374,427,43764,44281,45390,46177,47103,47304,47304,48004,48333,48678,49062,49214,6818,6912,6976,6981,6989,7031,2984,2979,2909,2898,2858,2828,47953,48240,48588,49103,49213,null,144832.79975572322,24098.974946150545,70363.315508982836,124793.62163950402,134227.10951988574,23213.73288,126294.07205999999,319648.22473999998,0,150835.96617550214,24446.934351270935,72495.722890361445,127316.45831700253,133219.89793054355,23469.983270999994,127026.36523799997,323330.87115899991,19.05,16.98,37925.64521372012,2778.4630000000002,5370.0990000000002,null,41991,1892,1976,1954,2050,2114,2182,null,0,0]
[139,"Upplands-Bro",7575997.7999999998,null,31731,32459,32539,32615,32688,32757,19.399999999999999,19.399999999999999,null,19.05,16.98,null,3768,3348,-1451.14244310499,-1245.3462180347942,31853,32453,2201,3253,484,4015,1163,3626,947,167,2190,3276,445,4167,1216,3644,1019,179,24353,24703,25287,25789,26755,27614,27614,28756,29346,30195,31082,31853,3743,3958,4109,4223,4362,4499,2022,2044,2095,2160,2188,2201,28624,29331,30097,30896,31731,null,147376.25671119508,22623.174918492019,70211.9213470494,127659.56540954336,142158.95077707915,24098.780939999997,128854.50629999999,339888.93639999995,694,153627.9755128478,22953.931553802133,72362.622005896774,130549.87686601271,140362.22770987102,24268.479803999995,126904.87746899997,341621.52971399995,19.05,16.98,24248.19603453757,2121.7139999999999,2923.8670000000002,null,22133,950,1036,1095,1129,1154,1163,null,0,0]
[140,"Nykvarn",3217554.1,null,11666,12077,12107,12135,12162,12188,19.97,19.97,null,19.05,16.98,null,2561,799,-549.66376258718105,-842.26672651404715,11664,12107,746,1201,178,1554,511,1453,457,50,751,1197,162,1581,542,1436,496,67,9442,9523,9815,10192,10424,10660,10660,10923,11014,11222,11500,11664,1666,1668,1678,1702,1733,1732,690,733,729,744,745,746,10867,11010,11217,11441,11666,null,141956.74866256086,23294.754085102013,71423.042812234547,126136.50264341028,146236.57405996183,20386.586739999999,113571.37011999999,324360.86072,1406,147921.05927830801,23632.753116468455,73582.283313378153,128859.75289170175,145612.18380304449,20074.555880999997,114143.46993899997,323846.93458799995,19.05,16.98,13023.612896310444,980.39700000000005,1525.299,null,8890,424,455,453,471,476,511,null,0,0]
[160,"Täby",26800981.899999999,null,74943,76584,76773,76951,77123,77286,17.55,17.55,null,19.05,16.98,null,2813,2106,-1419.5396832172501,-1425.0308325053284,75137,76738,4195,7298,960,9628,3208,9757,3676,729,4190,7200,942,9657,3256,9731,3941,787,65364,66292,67334,68281,69386,70405,70405,71397,71874,72755,73955,75137,10453,10606,10573,10520,10585,10588,4328,4215,4108,4180,4191,4195,71223,71993,72632,73716,74943,null,147753.17962595861,27124.774070201158,71021.747586472033,126203.62778009081,122973.21104299123,22108.783579999999,123451.68523999999,334012.56563999999,551,154039.13837822698,27519.91723553227,73173.62798844956,128883.19292050057,121596.10019082186,22229.146655999994,124789.74425999996,336315.52544399991,19.05,16.98,54829.471128070174,3876.8910000000001,7662.2520000000004,null,61486,2634,2793,2898,3040,3140,3208,null,0,0]
[162,"Danderyd",15727110.5,null,32727,32513,32593,32669,32742,32811,18.350000000000001,18.25,null,19.05,16.98,null,6584,6364,-686.49436048619395,-1129.3900449599987,32692,32419,1631,3214,404,4466,1750,4392,1769,477,1566,3062,380,4313,1750,4338,1902,476,31960,32222,32295,32421,32653,32888,32888,33187,32857,32712,32803,32692,5355,5326,5277,5176,5066,4870,1779,1769,1695,1642,1626,1631,33199,32885,32677,32804,32727,null,149117.69875093916,27952.140988104245,71852.755403012299,127395.33977387872,120703.35771355171,21892.1482,128022.80061999999,345569.35556,0,155366.11715280055,28355.836774130192,74021.57622024756,129945.32620630604,119437.33088523762,21854.299778999994,126699.28278299997,347384.41106399993,19.05,16.98,25695.121661446341,1870.8820000000001,3750.1260000000002,null,30801,1393,1474,1544,1614,1686,1750,null,0,0]
[163,"Sollentuna",24532592.100000001,null,76131,76708,76897,77076,77248,77411,18.12,18.12,null,19.05,16.98,null,2602,2323,-1264.23519721455,-1231.5059242098923,76237,76790,4483,7288,997,9722,3395,8617,2835,582,4464,7139,980,9577,3364,8606,3070,596,66859,68145,69325,70251,71023,71848,71848,72528,73857,73990,75108,76237,10770,10799,11025,10836,10830,10719,4500,4455,4494,4441,4516,4483,72420,73685,73948,74793,76131,null,148895.56755567947,26237.55790554257,70777.492713474057,127233.12509857528,127956.64371843202,23596.927119999997,126389.87061999999,341897.44029999996,0,155322.95601630787,26622.90395982984,72919.328451296256,129934.32767512208,126587.34994264325,23884.287713999995,127218.46128299997,343927.72061099991,19.05,16.98,53416.388899763435,3602.4949999999999,7186.4970000000003,null,61309,2749,2871,3006,3157,3202,3395,null,0,0]
[180,"Stockholm",324366108.89999998,null,984685,990261,992702,995010,997236,999344,17.739999999999998,17.98,null,19.05,16.98,null,-1140,-1250,-1973.94223227455,-2081.5356306002004,984748,988943,54464,74429,10817,94852,29162,117312,30225,7667,53162,72984,10196,94779,29996,118726,32502,7530,881235,897700,911989,923516,935619,949761,949761,962154,974073,975551,978770,984748,99460,102112,104489,105531,105627,105669,59680,59718,59132,57273,55531,54464,961609,974145,977619,979004,984685,null,143496.94073303067,23685.108235743064,69513.744790020821,124049.86291963856,128269.49915482081,28133.206659999996,139308.52416,349515.60305999999,0,149556.7946816514,24030.592375694803,71619.251258076212,126536.2893930358,126707.83641233882,28392.833807999992,139418.11767599997,350290.77230699989,19.05,16.98,312736.24645953538,28657.812000000002,53168.148999999998,null,794494,25159,25858,26623,27582,28338,29162,null,0,0]
[181,"Södertälje",22807669.300000001,null,102274,102525,102778,103017,103247,103465,20.149999999999999,20.149999999999999,null,19.05,16.98,null,2751,2737,1825.6507288494799,1650.7608900025107,102426,102519,6189,8856,1209,11447,3878,11911,3795,702,5994,8760,1284,11371,3823,11963,3987,730,89473,91072,92235,93202,94631,96032,96032,97381,98979,100111,101209,102426,11812,12105,12314,12437,12583,12656,5972,6004,6084,6064,6122,6189,97094,98869,100004,101009,102274,null,142981.34542116991,20813.057583277794,70205.449401223726,129166.51408854792,139923.06670932789,25854.724999999999,134902.87901999999,342692.13289999997,0,148985.44803797148,21116.114004589472,72338.746936718802,131778.92645053493,139806.36188475424,26124.023762999994,136391.30702099996,347488.24676399992,19.05,16.98,70874.410483770494,5719.7039999999997,8576.3009999999995,null,83338,3411,3407,3482,3719,3851,3878,null,0,0]
[182,"Nacka",37033551.5,null,109248,110529,110801,111059,111307,111542,17.98,17.88,null,19.05,16.98,null,2742,2466,-1363.7610451780399,-1703.8407824150318,109486,110633,7106,10621,1446,13964,4517,13450,3974,893,6955,10520,1494,13786,4621,13497,4371,924,92873,94423,96217,97986,99359,101231,101231,103656,105189,106505,108234,109486,15034,15156,15396,15435,15467,15410,6965,7008,6969,6975,6987,7106,103274,105185,106169,107921,109248,null,147936.78929013188,26203.443788544628,70893.157400183962,125776.02638300481,124685.25544002265,23948.551379999997,131199.39377999998,339009.33143999998,0,154145.26309651841,26584.184373452495,73035.032032015748,128238.32167670547,123682.20296925487,24046.271405999993,130763.41208099997,344086.58923199994,19.05,16.98,71608.414629873412,4729.8680000000004,9463.5280000000002,null,84082,3595,3830,4051,4295,4444,4517,null,0,0]
[183,"Sundbyberg",16330731.199999999,null,54120,55729,55866,55996,56121,56240,19.25,19.25,null,19.05,16.98,null,-4636,-5984,-2805.4447118704402,-2925.0458047751613,54070,55912,3375,4130,577,5084,1351,5530,1250,277,3405,4171,610,5200,1409,5594,1381,286,40793,42626,44090,46110,47750,49424,49424,50564,52414,52801,53564,54070,4921,5179,5395,5507,5608,5661,3384,3374,3489,3434,3311,3375,50349,52098,52667,53406,54120,null,149671.66933561038,24377.049248091658,69433.378736269282,125127.48922905115,130468.64659713485,29225.092519999998,145847.8645,364957.67775999999,842,156016.43666419687,24733.684835059728,71539.572535868385,127824.93580687519,128206.97489738042,29499.722369999992,145141.54145999998,357186.50114399992,19.05,16.98,14615.066408696093,1019.485,2056.5169999999998,null,34880,1105,1192,1230,1263,1275,1351,null,0,0]
[184,"Solna",28256203.399999999,null,85540,85604,85815,86014,86206,86388,17.37,17.37,null,19.05,16.98,null,-7904,-7768,-3260.09253513053,-3388.9189314032183,85450,85426,4803,5423,902,6606,1851,9520,2733,704,4754,5392,807,6726,1889,9539,2908,684,71293,72740,74041,76158,78129,79707,79707,80950,82429,83162,84187,85450,6535,6732,7030,7238,7343,7508,4987,5019,5131,5037,4929,4803,81216,82482,83293,84284,85540,null,147218.15406171972,25038.145747978375,68538.039429168552,121868.16512218723,123706.52271034327,27899.153359999997,139484.8806,351389.11807999999,0,153606.71777101679,25409.32165634304,70636.503876229472,124633.66149076604,122791.3276514514,28064.712995999995,139680.82199699996,349437.24285299995,19.05,16.98,18919.87345831552,1771.972,3184.8690000000001,null,63551,1538,1573,1605,1656,1729,1851,null,0,0]
[186,"Lidingö",19472275.399999999,null,48541,48407,48526,48639,48748,48851,17.84,17.84,null,19.05,16.98,null,4145,4328,-572.87805172938499,-655.40731932681865,48432,48324,2638,4629,625,6047,2119,7076,2446,662,2540,4503,628,5972,2112,7002,2625,679,44434,45178,45465,46302,46853,47185,47185,47818,48123,48005,48162,48432,6841,6887,6927,6775,6714,6672,2839,2844,2808,2760,2678,2638,47783,48123,48021,48073,48541,null,146411.3703800012,26838.284793790044,70559.075016721719,125032.36851841785,120326.78020421189,23387.912079999998,130492.87939999999,334219.40343999997,0,152522.9607573853,27226.504847157135,72701.69266559431,127618.40636963125,119604.99028225869,23534.361404999996,130483.05569099997,336622.87911599991,19.05,16.98,32467.968254801086,2320.3620000000001,4591.2150000000001,null,42693,1708,1828,1897,2033,2058,2119,null,0,0]
[187,"Vaxholm",4034191.4,null,11919,11790,11819,11846,11872,11897,19.3,19.3,null,19.05,16.98,null,1144,936,-2248.3873590542498,-2430.1795335836941,11899,11817,550,1136,144,1513,561,2141,521,90,523,1054,126,1448,557,2134,609,88,11126,11188,11329,11380,11621,11831,11831,12023,12003,11886,11996,11899,1850,1815,1807,1743,1729,1657,670,657,636,578,563,550,11961,11988,11875,11967,11919,null,144246.1355168088,26416.686240662166,72931.796989588096,128292.79470598677,133682.20009917021,21356.547159999998,129096.17993999999,338964.69801999995,0,150155.86376963771,26792.672520785451,75118.19303189691,130704.64126782432,133957.19430476078,21455.570690999994,125584.08736499997,355940.47274399991,19.05,16.98,17261.506145893632,1255.251,2238.8919999999998,null,10599,468,512,503,550,552,561,null,0,0]
[188,"Norrtälje",15207942.6,null,65478,65851,66013,66166,66314,66454,19.72,19.72,null,19.05,16.98,null,1211,2080,-429.64552263708401,-187.30417955693338,65587,65770,3269,4798,693,6099,1952,13375,3968,794,3183,4835,694,6175,1941,13328,4326,816,56634,56845,57568,58669,59420,60808,60808,61769,62622,63673,64762,65587,6138,6248,6392,6589,6698,6792,3076,3170,3233,3234,3252,3269,61534,62430,63536,64609,65478,null,135854.75349411013,20356.178893199522,72954.415142837941,128279.60705548279,151296.2428065897,23922.424499999997,132515.53535999998,350967.82213999995,0,141607.11235460197,20654.128876574738,75184.171283259871,131011.48698534891,151958.37169694054,24377.507288999994,133320.88537199996,354875.11846199993,19.05,16.98,171721.29052546536,29326.998,16629.325000000001,null,55132,1865,1913,1938,1934,1919,1952,null,0,0]
[191,"Sigtuna",12109028,null,51470,52555,52685,52807,52925,53037,20,20,null,19.05,16.98,null,4031,3827,-991.97821810048799,-822.55382326860126,51876,52529,3505,5036,770,6400,1931,5378,1802,270,3425,5041,710,6459,2057,5421,1916,286,42272,43372,44085,44786,46274,47146,47146,48130,48964,49537,50273,51876,6127,6334,6479,6708,6817,7170,3409,3495,3554,3543,3485,3505,47923,48780,49373,50198,51470,null,147142.74315707668,21549.266631530485,70904.479334075644,129955.24365225161,134543.00468970349,24797.67498,133113.18773999999,344969.52593999996,573,153297.98113287232,21862.412469092651,73059.040861938716,132690.09326733844,134581.9774352712,25262.187452999995,132055.12818899998,349173.50017499994,19.05,16.98,35219.158370586825,2265.6219999999998,4232.6090000000004,null,37588,1654,1703,1794,1860,1916,1931,null,0,0]
[192,"Nynäshamn",7082582.9000000004,null,29921,30247,30322,30392,30460,30524,19.850000000000001,19.850000000000001,null,19.05,16.98,null,799,1520,-1450.33319255728,-1534.6070930370888,30043,30311,1726,2502,403,3148,964,4946,1484,255,1705,2580,397,3245,975,4939,1580,273,26572,26796,27041,27500,27752,28109,28109,28290,28575,28811,29495,30043,3173,3215,3293,3353,3434,3551,1689,1726,1729,1717,1727,1726,28224,28576,28784,29290,29921,null,139442.67969353683,21026.182242698655,70371.394976542186,125583.13062197833,146313.73391091224,23993.184799999999,128900.22833999999,332916.32529999997,0,145417.34301766937,21335.848231987016,72531.486039312702,128374.89532543928,145038.64238948561,24232.137308999994,130068.75124799997,329742.72563399991,19.05,16.98,37804.468527620978,3649.547,4545.0609999999997,null,25301,911,926,985,973,976,964,null,0,0]
[305,"Håbo",5906923.0999999996,null,22636,22934,22991,23044,23096,23145,21.09,21.59,null,19.14,17.07,null,-1787,-1787,-938.72554369433897,-863.23585539960732,22765,22974,1350,2193,346,2802,972,3045,875,126,1339,2148,282,2855,960,3006,981,127,19883,19968,20034,20279,20737,21083,21083,21564,21934,22019,22344,22765,3000,3063,3073,3096,3134,3148,1358,1396,1434,1406,1393,1350,21440,21881,21962,22250,22636,null,138021.454002649,22021.773160068868,70111.262081854409,124094.53089512627,139292.71739325739,21107.25318,121026.23987999999,331750.41327999998,67,143945.18602330488,22344.563152458515,72243.790182083947,126659.53189301472,137770.42547267667,21314.354138999995,119766.17309399997,336586.53662099992,19.14,17.07,24565.098418169368,1861.232,3083.33,null,18830,858,870,903,918,918,972,null,0,0]
[319,"Älvkarleby",2122148.2999999998,null,9605,9581,9605,9627,9649,9669,22.69,22.69,null,19.14,17.07,null,1181,735,-1543.1043557123,-1281.4911478958365,9625,9572,538,795,101,1062,331,1756,534,86,510,784,114,1018,332,1775,547,89,9059,9132,9169,9293,9445,9402,9402,9392,9457,9511,9627,9625,1101,1130,1119,1143,1161,1163,514,504,537,532,544,538,9339,9447,9518,9604,9605,null,135758.42741322526,20557.118793421196,69665.23972054827,123559.24850949524,156558.00677201408,22064.150159999997,129323.70151999999,342649.67671999999,0,141333.40136527581,20852.972021225574,71761.157801311667,125884.1997820801,156066.95426988517,22767.015581999996,133114.25232899998,326917.35623699991,19.14,17.07,13780.693853687788,4551.8119999999999,868.76199999999994,null,9111,278,296,317,339,337,331,null,0,0]
[330,"Knivsta",5527393.7999999998,null,20080,20538,20589,20637,20683,20727,20.91,20.91,null,19.14,17.07,null,1725,622,-2093.61329233283,-2057.8664889416423,20133,20714,1451,2284,323,2884,912,2182,499,96,1420,2325,340,2923,931,2227,549,106,15279,15580,16105,16869,17323,18064,18064,18720,18835,19106,19818,20133,3010,3094,3099,3141,3172,3207,1474,1499,1507,1423,1435,1451,18671,18847,19070,19708,20080,null,144867.67686828668,25146.065381186021,70749.822909952549,125373.68407680743,135152.81579259102,20139.469999999998,126720.81109999999,330338.47313999996,659,150820.88578485654,25508.223458162811,72898.026022282647,128008.73804848541,135355.45096476885,20939.507261999996,124451.23987799996,332516.17718099995,19.14,17.07,21936.066209750876,1488.5160000000001,2264.0160000000001,null,13881,654,734,798,872,902,912,null,0,0]
[331,"Heby",3005482.5,null,14386,14354,14389,14422,14454,14485,22.5,22.5,null,19.14,17.07,null,2159,2253,-21.398132315217499,-267.68902107517533,14421,14343,793,1202,166,1547,445,2605,812,159,742,1197,170,1540,458,2613,839,165,13364,13450,13490,13594,13755,13854,13854,13910,14047,14101,14303,14421,1463,1495,1518,1577,1648,1713,798,784,788,806,799,793,13879,14054,14048,14262,14386,null,134781.96370649806,19069.948351299172,73731.802944321636,129994.82693564668,155966.46378490969,23169.099459999998,133810.99315999998,346262.80649999995,0,140192.26453034673,19341.74365650531,75978.387379616368,132775.16514277834,155961.78424758927,23302.807793999993,134790.16052699997,349432.05106799991,19.14,17.07,23826.34583228577,5438.424,1325.9649999999999,null,13492,506,484,477,459,452,445,null,0,0]
[360,"Tierp",4525704.0999999996,null,21403,21209,21261,21310,21358,21403,21.29,21.29,null,19.14,17.07,null,2926,3167,1299.7210967390799,1095.2512388409395,21406,21193,1180,1823,281,2288,735,3733,1176,278,1138,1802,236,2326,688,3790,1218,272,20156,20144,20245,20547,20744,20930,20930,21127,21136,21327,21485,21406,2259,2341,2355,2393,2523,2569,1276,1288,1275,1302,1279,1180,21140,21128,21345,21454,21403,null,136419.32631594886,19705.832330893878,72878.269553726626,129012.67330984952,155155.12805275357,23067.857799999998,129871.27737999998,337661.61987999995,0,142221.64096811874,19994.42584758822,75109.781953284895,131693.8563001974,157204.00123031301,23379.646211999996,130650.23116799997,340683.89334299992,19.14,17.07,34038.23133595159,7919.8249999999998,2031.6990000000001,null,20054,630,649,654,722,709,735,null,0,0]
[380,"Uppsala",60221256.700000003,null,241870,245663,246269,246842,247394,247917,21.14,21.14,null,19.14,17.07,null,-4227,-4630,-283.75921443196302,-419.71521267052867,242140,245329,13239,19353,2743,24801,7786,30541,8577,1947,13060,19238,2662,24979,7978,30641,9281,1937,202625,205199,207362,210126,214559,219914,219914,225164,230767,233839,237596,242140,24699,25528,26261,26646,27154,27544,13154,13268,13533,13446,13143,13239,224519,230416,233745,237180,241870,null,137950.69642652117,22775.364797977294,68754.859610411659,122635.59513917236,132173.20510632009,23300.822479999999,126886.28133999999,329643.93357999995,205,143800.14450573383,23107.915887016072,70839.394369216476,125172.51929194984,131029.79255195516,23513.594264999996,127709.60414399997,333472.50397799991,19.14,17.07,154276.54013452973,13827.072,18613.117999999999,null,187348,6590,6892,7098,7396,7593,7786,null,0,59]
[381,"Enköping",11406073.300000001,null,47770,48264,48383,48495,48603,48706,21.34,21.34,null,19.14,17.07,null,735,914,168.63405180981499,243.20573171608794,47848,48292,3019,4284,648,5390,1715,7169,2206,463,2931,4351,650,5508,1716,7240,2333,473,40349,40656,41163,41893,42988,43797,43797,44429,45287,46240,47489,47848,5180,5409,5561,5719,5927,6038,2696,2713,2815,2930,3097,3019,44230,45069,46176,47352,47770,null,137385.88974352877,20935.500941707083,70237.804627892343,125343.96663820895,137543.57701375632,22028.225699999999,126706.65903999998,336030.86711999995,0,143116.03526546928,21239.455107549842,72385.139402712739,127851.70213849985,137194.89815393221,22140.886310999995,125630.81342999997,339219.80997299991,19.14,17.07,52472.924518203508,6613.4049999999997,5771.4229999999998,null,38723,1509,1538,1573,1595,1659,1715,null,0,0]
[382,"Östhammar",5332916.3,null,22320,22171,22226,22278,22328,22375,21.69,21.69,null,19.14,17.07,null,-556,540,-679.39014804153499,-609.79572710802859,22344,22172,1130,1783,262,2212,725,4726,1351,271,1111,1776,235,2242,715,4663,1449,274,21262,21352,21374,21563,21822,21927,21927,22048,22250,22251,22364,22344,2309,2346,2391,2408,2459,2474,1229,1220,1226,1232,1166,1130,22022,22202,22212,22344,22320,null,132978.85326543014,19270.178752417793,71408.076366927038,124904.21867999287,159776.13800507048,22457.141979999997,128972.07725999999,331187.59673999995,0,138814.69101967436,19556.845680179675,73593.810445781084,127586.18663429341,157208.35539455141,23022.451403999996,130858.94092499997,340086.83806799992,19.14,17.07,47329.707625115952,9253.1579999999994,4048.107,null,21417,646,635,655,666,690,725,null,0,0]
[428,"Vingåker",1819419.6,null,8985,8912,8934,8955,8975,8994,22.67,22.67,null,19.87,17.8,null,3064,2772,678.38396363540096,1407.7900639960435,8981,8856,478,721,104,901,350,1834,512,90,470,720,100,911,318,1804,532,89,8775,8835,8919,8953,9099,9180,9180,9136,9111,9144,9063,8981,1106,1085,1063,1068,1040,1005,501,502,523,490,484,478,9132,9124,9153,9074,8985,null,133667.72746309359,18557.894750797372,71230.474654871752,126518.94209684667,159702.04370854257,22127.290119999998,133127.33979999999,353552.20601999998,0,139585.78574505638,18835.544966708323,73418.198860988661,129076.81965717293,162325.88866192152,22944.574628999995,131955.44591699998,349483.96891799994,19.87,17.8,13788.088342271754,4211.7290000000003,732.65,null,9135,336,357,355,372,355,350,null,0,0]
[461,"Gnesta",2655803.2000000002,null,11588,11493,11521,11548,11574,11598,22.12,22.12,null,19.87,17.8,null,1211,2257,1669.84437420824,1688.9092567619109,11612,11520,658,1074,141,1359,382,2119,570,99,629,1044,146,1354,401,2075,619,110,10442,10409,10513,10649,10861,11019,11019,11237,11365,11421,11513,11612,1401,1451,1448,1469,1477,1500,691,681,681,666,662,658,11203,11356,11378,11499,11588,null,138359.3962397319,21446.739063872763,70594.415549319747,124558.46656413162,155725.02420062918,22861.019999999997,130556.01935999999,348360.57723999996,0,144133.15062172705,21757.296969416948,72748.84101153673,127135.78171915781,154509.86919216232,23585.240897999993,133749.72681299996,347912.93477699993,19.87,17.8,19208.813987610818,3383.848,2079.1779999999999,null,10012,345,361,398,403,400,382,null,0,0]
[480,"Nyköping",13465573.199999999,null,58012,58278,58422,58558,58689,58813,21.42,21.42,null,19.87,17.8,null,2167,2290,842.32010078186795,941.51309641241733,58021,58200,3237,5006,753,6361,2144,9914,3320,679,3183,4951,688,6381,2168,9834,3497,693,52336,53038,53508,54262,54924,55467,55467,56011,56591,57071,57633,58021,6531,6702,6837,6955,7039,7114,3272,3308,3323,3345,3292,3237,55947,56566,57092,57560,58012,null,135756.47550529259,20499.905379254469,69251.882472670011,123311.68463059913,141466.38583305146,22305.823799999998,125124.89417999999,331637.19679999998,0,141580.50461731397,20800.991205952258,71354.8076190172,125836.47942016846,141331.42547117287,22750.401869999994,125819.79440399997,330355.35626399994,19.87,17.8,64454.275761480494,8405.0509999999995,6819.4570000000003,null,50694,1822,1860,1896,1990,2098,2144,null,0,0]
[481,"Oxelösund",2665430.4,null,12094,12118,12148,12176,12203,12229,22.22,22.22,null,19.87,17.8,null,2938,3174,-680.60410542098703,-144.69830987729256,12086,12106,715,960,145,1215,390,2417,817,157,665,972,168,1201,404,2379,874,164,11236,11403,11551,11701,11921,12008,12008,12062,11983,11995,12132,12086,1249,1319,1315,1351,1360,1360,666,706,700,710,734,715,12027,11953,11986,12097,12094,null,135857.18762183111,19617.992099063624,68432.045460809604,122105.43182595522,161329.89642483109,23919.158639999998,131609.80351999999,336483.73303999996,0,141215.3047719585,19895.371749117872,70511.577595918541,124575.82025460624,158248.97728382912,24030.696050999995,131174.60145299998,342764.76077099994,19.87,17.8,15174.239597937913,1777.682,1503.462,null,11094,320,304,330,353,362,390,null,0,0]
[482,"Flen",3210609.5,null,16112,15750,15789,15826,15861,15895,22.27,22.27,null,19.87,17.8,null,4898,5735,1937.44435359665,1418.9091887211625,16058,15668,828,1289,188,1668,556,3444,1050,186,762,1242,185,1584,549,3406,1072,199,16019,16156,16242,16440,16830,16864,16864,16705,16585,16431,16316,16058,1949,1943,1896,1870,1860,1856,915,942,909,894,868,828,16712,16555,16468,16301,16112,null,136102.8514952136,18775.006107752157,70270.182490708656,127053.2169813153,153887.7744078043,23507.66028,128827.29079999999,357599.69517999998,0,141574.39748647745,19042.479327523764,72385.548453417141,129121.88687594801,157126.10343353404,23894.671283999993,128760.42142799997,353361.19395599992,19.87,17.8,25523.533113811529,8073.3620000000001,1936.0719999999999,null,16185,623,630,641,598,590,556,null,0,0]
[483,"Katrineholm",7391396.0999999996,null,34580,34334,34419,34499,34576,34649,22.12,22.12,null,19.87,17.8,null,2637,2773,2753.2379684098901,3036.1260545388168,34604,34324,2040,2947,451,3740,1226,5921,1799,430,1863,2953,455,3704,1262,5928,1884,452,32549,32930,33268,33462,33722,34133,34133,34550,34755,34765,34764,34604,3977,4076,4176,4174,4150,4191,2146,2194,2216,2216,2169,2040,34425,34737,34796,34804,34580,null,135812.58251361104,19185.034158289611,68969.190823626428,123940.51856066084,147134.21211346082,23178.89704,130307.81399999998,340226.40859999997,0,141088.02932495048,19454.50237440272,71067.826150495574,126396.66795556217,145853.32444536005,23286.194081999995,129985.68268799997,340422.22737899993,19.87,17.8,36748.939837978061,7053.7110000000002,3395.09,null,32138,1229,1261,1262,1270,1256,1226,null,0,0]
[484,"Eskilstuna",23210664.5,null,107857,107713,107979,108230,108472,108701,22.02,22.02,null,19.87,17.8,null,2181,2370,-47.0276229227211,62.852947516604218,107918,107468,6246,9597,1424,12286,4063,15780,4879,1043,6025,9490,1274,12313,4124,15724,5123,1040,98765,99729,100923,102065,103684,104709,104709,105924,106859,106975,107593,107918,12765,13109,13345,13550,13662,13710,6626,6727,6762,6603,6491,6246,105727,106733,107061,107490,107857,null,137020.19717101948,20132.304225302545,68402.998897749974,123788.35723018077,140412.17409596627,23534.875779999998,128350.47523999999,340297.16889999999,0,142792.62616719125,20425.62658533948,70484.868065497605,126329.87191625682,139213.70467721342,24003.698768999995,129844.46613599997,340854.18389099994,19.87,17.8,94863.137777322641,11684.578,10329.414000000001,null,93101,3785,3828,3858,3871,3934,4063,null,0,0]
[486,"Strängnäs",9637801.8000000007,null,38495,38852,38948,39039,39126,39209,21.67,21.67,null,19.87,17.8,null,467,319,-1291.73161483225,-1260.5458868043343,38526,38917,2223,3463,494,4453,1511,6588,1860,342,2107,3476,535,4474,1537,6621,2011,362,33072,33389,33878,34102,34609,35045,35045,35761,36544,37290,38129,38526,4547,4644,4715,4869,4972,4947,1982,2053,2165,2171,2222,2223,35620,36461,37158,37974,38495,null,136104.04439846153,21739.614352548262,69652.176374668576,123584.9957216921,142062.43228716074,21675.51282,126432.3268,333308.22849999997,0,141554.26813321077,22048.9656410813,71771.902156898752,126184.77150430629,142548.72558443609,22195.919231999993,124975.61016299998,329903.67096899991,19.87,17.8,48237.568699485841,5619.6819999999998,5209.9920000000002,null,31378,1210,1274,1317,1346,1436,1511,null,0,0]
[488,"Trosa",3842807.3,null,14750,14860,14897,14932,14965,14997,21.5,21.4,null,19.87,17.8,null,-1387,-1323,-1886.29770428389,-1942.3195436984397,14760,14885,875,1333,192,1687,506,2805,730,115,833,1343,195,1711,500,2816,821,111,11529,11680,11864,12078,12447,12916,12916,13309,13747,14309,14658,14760,1634,1623,1704,1786,1838,1879,730,786,819,839,861,875,13249,13684,14237,14583,14750,null,137960.77270790463,21420.278746819517,69772.191035890486,123535.57363924666,148514.39040638693,20375.700539999998,119189.73793999999,325519.15239999996,0,143546.15514985597,21726.841472465683,71901.023852840939,126108.73687556261,145176.21100555043,20843.978417999995,119439.09063899997,330059.42451899993,19.87,17.8,21667.723635991366,2112.232,2511.652,null,11014,428,480,484,513,495,506,null,0,0]
[509,"Ödeshög",1129938.8,null,5303,5267,5280,5292,5304,5315,22.6,22.6,null,18.93,16.86,null,1492,2298,-203.55932639170399,30.329889547347193,5317,5279,267,422,82,500,183,1118,322,80,271,417,50,525,163,1101,334,89,5200,5174,5240,5236,5335,5343,5343,5323,5337,5338,5309,5317,584,577,563,572,571,582,291,298,318,318,324,267,5297,5348,5324,5326,5303,null,135294.25384366314,19524.480352627845,72400.171840862371,127517.12676883808,164030.94135237686,22145.79666,129249.67535999999,343469.40758,0,141532.1384034316,19821.928453951947,74622.020830850612,130286.38903724993,165100.17931410219,22865.659496999993,129020.01067799996,340355.77253099991,18.93,16.86,7901.8329466135501,2541.84,178.28200000000001,null,5368,188,167,161,166,181,183,null,0,0]
[512,"Ydre",795016.6,null,3689,3659,3668,3677,3685,3693,22.55,22.55,null,18.93,16.86,null,5054,4851,-1440.6341330161499,-2201.2877570394894,3683,3637,189,273,43,349,121,883,251,50,179,265,35,335,131,874,268,44,3612,3617,3660,3658,3675,3733,3733,3743,3747,3726,3695,3683,399,393,392,389,376,392,204,204,199,193,187,189,3749,3776,3732,3699,3689,null,135508.34448081331,20661.489989665337,78089.262908263205,136993.59029457884,156548.45602637157,21837.717199999999,130877.16226,344323.97427999997,0,141115.60061379589,20959.877783303706,80427.056685192787,139602.62415468224,157260.99857181875,21635.206451999995,131933.64041999998,371892.75133499992,18.93,16.86,8451.910083633873,2645.8,295.99,null,3766,129,123,112,110,122,121,null,0,0]
[513,"Kinda",2233784.5,null,10078,10001,10026,10049,10071,10092,21.45,21.45,null,18.93,16.86,null,4124,4233,-247.35729154536401,-201.20750269349446,10068,9992,550,792,146,991,371,1971,648,132,558,784,106,1016,345,1962,688,117,9744,9802,9795,9795,9874,9882,9882,9915,9940,9991,10048,10068,1155,1145,1118,1119,1106,1137,551,537,544,563,581,550,9897,9952,9999,10069,10078,null,134760.7926190584,19860.786074209242,72378.458011015857,127046.51812852068,151643.93260350969,22503.95264,136287.60365999999,349414.36139999999,0,140928.10536268982,20162.731185828645,74590.081568513677,129739.02945897455,151620.31228072167,22527.155114999994,138763.95276599997,349266.95230499993,18.93,16.86,21553.00508198058,4474.6499999999996,1185.0830000000001,null,9945,312,330,334,353,359,371,null,0,0]
[560,"Boxholm",1226573.3999999999,null,5505,5509,5523,5536,5548,5560,21.82,21.82,null,18.93,16.86,null,-334,511,264.10493203282698,-132.65077942557309,5498,5523,278,445,65,545,164,1102,306,71,285,448,61,566,167,1090,343,62,5206,5278,5322,5328,5373,5453,5453,5449,5476,5441,5512,5498,557,552,572,581,595,610,320,312,307,286,275,278,5449,5475,5443,5489,5505,null,131970.67693460194,19422.055582126537,70928.695984037986,124774.71743566591,159808.72960269274,23044.996779999998,132093.1508,337423.2121,0,138050.18969961198,19717.795714081545,73112.037976852516,127464.05479560824,155162.17347695745,23289.309152999995,129859.00313399997,354012.2437949999,18.93,16.86,12460.279646769113,3260.7510000000002,590.23099999999999,null,5210,185,184,177,166,163,164,null,0,0]
[561,"Åtvidaberg",2532017.7000000002,null,11473,11447,11475,11502,11528,11552,22.39,22.39,null,18.93,16.86,null,-499,85,131.55174465944199,464.97381532599866,11506,11460,612,894,143,1129,397,2192,742,139,618,911,115,1147,378,2172,784,135,11446,11460,11472,11545,11617,11631,11631,11537,11503,11427,11462,11506,1254,1259,1294,1261,1258,1272,640,641,640,620,594,612,11532,11496,11414,11447,11473,null,134931.63620733505,20383.401324106715,71362.08848830995,124925.07797125827,148214.69469935115,20908.03572,129129.92715999999,342614.84087999997,0,141053.07693475467,20692.225412176373,73538.75871307998,127351.07731437837,150501.37892569462,21302.932211999996,130611.81195899997,340248.8217599999,18.93,16.86,15826.706019539439,3407.6219999999998,1127.039,null,11653,390,380,371,385,378,397,null,0,0]
[562,"Finspång",5000435.5,null,21890,21783,21837,21888,21937,21983,22.15,22.15,null,18.93,16.86,null,978,1755,1014.72378274854,1598.5405278252601,21903,21694,1129,1877,260,2349,678,3935,1263,259,1092,1852,229,2382,713,3864,1369,251,20791,20903,21150,21199,21526,21577,21577,21758,21912,21765,21889,21903,2347,2427,2461,2477,2546,2609,1256,1242,1243,1220,1187,1129,21707,21884,21794,21876,21890,null,134518.87725118891,19878.998235297076,71021.576833711137,126124.33459914246,154289.59155147301,21838.805819999998,129098.35717999999,347492.94709999999,0,140270.50710703796,20170.590313535802,73196.849488910128,128874.33701900014,151348.27317191201,22324.675499999994,126919.41446699997,350646.92875799991,18.93,16.86,31960.299384643262,6411.3090000000002,1982.7090000000001,null,20740,708,725,733,687,685,678,null,0,0]
[563,"Valdemarsvik",1565033.6,null,7630,7557,7576,7594,7611,7627,22.48,22.48,null,18.93,16.86,null,544,-404,1853.49039941601,2028.6337290480615,7630,7541,360,483,73,650,248,1861,523,116,331,504,86,640,241,1825,556,105,7597,7585,7657,7747,7809,7920,7920,7956,7873,7737,7660,7630,786,782,799,758,736,723,365,383,394,382,369,360,7955,7886,7737,7657,7630,null,129500.11991694056,18832.965085896176,72351.442467268847,126978.08654431632,160391.80772002059,22411.41994,128063.07955999998,329232.43521999998,0,134540.00562780906,19098.873911696177,74559.809277779175,129415.67962627603,157292.09422501078,22672.525094999994,127289.06955899997,338593.68070199993,18.93,16.86,17969.712706071103,6242.0919999999996,1165.6949999999999,null,7976,245,243,216,232,238,248,null,0,0]
[580,"Linköping",41036648.5,null,166542,167578,167991,168382,168759,169116,20.2,20.2,null,18.93,16.86,null,-3532,-3576,-373.74290303794101,-791.52210472670959,166673,167404,8995,13604,1947,17520,5663,20785,7091,1580,8793,13386,1786,17484,5813,21001,7370,1613,148521,150202,151881,152966,155817,158520,158520,161034,163051,164616,165527,166673,17955,18573,18867,19147,19361,19467,9582,9473,9392,9293,9114,8995,160754,162984,164750,165547,166542,null,135702.91340769874,22051.975952728993,68404.737980048012,122163.97346528916,132367.49632707136,21735.386919999997,122339.11559999999,328291.86753999995,0,141456.79882155862,22373.791517418133,70475.846508162547,124597.9784719067,131655.40319335897,22104.543815999994,122967.42772499997,327583.98143099993,18.93,16.86,126054.30492700412,11591.124,15308.456,null,140351,4934,5037,5168,5341,5535,5663,null,0,0]
[581,"Norrköping",33559429.700000003,null,145163,145222,145580,145918,146244,146553,21.75,21.75,null,18.93,16.86,null,-400,-709,1078.56104367599,1126.3115208447871,145120,145163,8272,12458,1772,16053,5194,20651,6288,1299,8049,12089,1614,15987,5254,20712,6578,1315,132124,133749,135283,137035,139363,140927,140927,141676,143171,143478,144458,145120,16608,17044,17474,17569,17776,17825,8790,8608,8569,8483,8323,8272,141515,142921,143504,144328,145163,null,135372.66349870642,20253.126692111829,68258.995265398451,122257.46413807783,139017.11473310427,23389.000699999997,131179.79861999999,336750.44493999996,0,141104.54889488182,20548.473888770041,70328.25329483785,124615.63562293114,137689.99655367498,23813.679437999996,130925.39577299997,338920.76315699989,18.93,16.86,127147.81264571559,12982.856,14061.016,null,126489,4633,4662,4691,4852,5015,5194,null,0,0]
[582,"Söderköping",3434739.5,null,14844,14860,14897,14932,14965,14997,21.18,21.98,null,18.93,16.86,null,-170,530,2162.4451749351601,2369.3596178198286,14834,14867,841,1380,191,1722,497,2890,804,145,809,1375,201,1727,526,2854,880,140,14143,14195,14268,14240,14402,14521,14521,14618,14626,14616,14673,14834,1761,1772,1794,1844,1876,1913,878,886,861,854,828,841,14595,14637,14614,14657,14844,null,136745.68881941665,21662.863520883682,70284.327234272074,123253.90382700055,149668.78517537258,21012.543239999999,122409.87589999998,328155.79003999999,0,142420.71480626173,21976.187431598839,72426.972318140994,125771.43080937627,147015.51117706439,21362.118560999996,124814.66482799996,342679.61549699993,18.93,16.86,27730.480141254659,2965.125,2585.1795000000002,null,14025,467,508,512,520,504,497,null,0,0]
[583,"Motala",9613615.5999999996,null,43733,43776,43884,43986,44084,44177,21.7,21.7,null,18.93,16.86,null,704,745,888.13513675827198,895.17235247878216,43728,43728,2397,3593,511,4664,1530,7643,2381,539,2270,3604,537,4654,1569,7688,2536,539,41867,42187,42556,42903,43258,43549,43549,43687,43673,43640,43674,43728,5071,5119,5056,5070,5152,5175,2438,2475,2503,2505,2435,2397,43631,43680,43636,43647,43733,null,134676.03625800519,20147.568394521291,68974.088985867362,122631.07997492433,141275.39049937177,21433.839179999999,127266.20971999998,333717.54961999995,0,140144.15826475518,20436.319740002666,71073.791780423402,125091.60408480445,139569.06488499223,21754.617506999995,126459.42231599997,340252.97518799989,18.93,16.86,51368.59420610941,7015.9080000000004,4411.4780000000001,null,42007,1444,1519,1531,1559,1550,1530,null,0,0]
[584,"Vadstena",1790863.1,null,7508,7431,7449,7466,7483,7499,22.8,22.8,null,18.93,16.86,null,-564,35,66.3686871881537,-71.309139558730749,7481,7434,323,508,78,629,208,1772,603,112,305,510,63,638,209,1754,636,118,7338,7383,7393,7407,7348,7421,7421,7514,7428,7423,7528,7481,699,728,691,697,692,707,342,342,324,317,337,323,7493,7452,7440,7491,7508,null,134265.1410645193,20300.574904071971,68224.477499341083,118557.23780989219,142584.47665939259,22853.399659999999,133174.15046,329289.04345999996,0,139711.96976861247,20591.759418890095,70305.755853823634,121150.74291990127,144279.48076459704,23103.443249999993,133383.18679199996,329968.04910299991,18.93,16.86,10132.302967876043,1754.8810000000001,916.51900000000001,null,7557,232,223,246,238,240,208,null,0,0]
[586,"Mjölby",6605324.7000000002,null,28439,28570,28640,28707,28771,28832,21.9,21.9,null,18.93,16.86,null,-303,65,365.166037964255,301.20403000021724,28471,28576,1665,2452,362,3123,1030,4402,1440,324,1658,2463,364,3187,1025,4346,1545,321,26195,26313,26428,26602,26708,27019,27019,27373,27758,27960,28269,28471,3241,3294,3354,3433,3457,3485,1633,1694,1703,1686,1687,1665,27286,27723,27889,28212,28439,null,134561.78431003098,20850.99513018697,68930.608647904111,121904.03869378605,145206.41807066902,21778.931719999997,124281.21367999999,336834.26867999998,0,140434.2826948381,21160.246664146318,71041.831157652196,124562.89135546223,144787.57673136689,22189.689089999996,124531.19336699997,335863.84014899994,18.93,16.86,33271.524556536016,4304.29,3029.0230000000001,null,25503,895,897,904,929,984,1030,null,0,0]
[604,"Aneby",1521028.3,null,6833,6846,6863,6879,6894,6909,22.09,22.09,null,19.140000000000004,17.070000000000004,null,497,433,-203.03056128870799,129.43847864643612,6824,6852,442,600,92,749,209,1206,349,68,407,630,109,764,221,1232,354,72,6407,6375,6426,6537,6603,6776,6776,6832,6848,6821,6892,6824,771,791,798,808,852,841,446,468,448,473,449,442,6799,6834,6796,6899,6833,null,136670.72056415706,20148.565501362053,72314.786023425928,128232.06701099436,150968.83386591688,20550.968359999999,129503.32381999999,344851.95497999998,0,141990.17353482245,20432.589739210511,74538.253405943338,130873.47764462332,153493.30050055019,20594.772737999996,126947.45010599997,325318.28645699995,19.140000000000004,17.070000000000004,10985.440973986921,3367.7820000000002,432.06200000000001,null,6493,229,218,227,215,212,209,null,0,0]
[617,"Gnosjö",2223784.2999999998,null,9438,9281,9304,9326,9347,9367,22.24,22.24,null,19.140000000000004,17.070000000000004,null,-904,-1307,-950.61287035140003,-449.70115342352346,9438,9246,538,794,111,1030,395,1562,396,111,486,799,116,996,386,1525,426,106,9354,9406,9509,9514,9615,9733,9733,9776,9712,9614,9570,9438,1237,1222,1190,1188,1157,1141,572,606,629,606,563,538,9766,9713,9609,9582,9438,null,133129.70074013065,18321.851770422712,70484.227475519714,127067.94467594469,145767.47764272525,20203.69858,123993.81799999998,333087.23864,0,138292.89882951116,18579.491089559342,72622.179108831813,129605.43386467709,145058.44144102384,20862.668843999996,124679.67841799997,333554.53418099991,19.140000000000004,17.070000000000004,9034.0310195812945,2745.4279999999999,340.39800000000002,null,9682,373,369,366,394,404,395,null,0,0]
[642,"Mullsjö",1616740,null,7512,7579,7598,7616,7633,7649,22.34,22.34,null,19.140000000000004,17.070000000000004,null,-1217,-347,-987.76210556634305,-1137.9840819400561,7532,7577,439,678,97,866,279,1392,351,84,452,649,74,866,312,1396,381,82,7070,7039,7109,7157,7226,7328,7328,7324,7290,7385,7430,7532,969,962,952,975,957,963,460,443,424,426,432,439,7313,7309,7355,7425,7512,null,134761.24555228418,20247.415383419269,68604.35294585333,120706.50235266158,149846.26305856463,20561.85456,123398.34285999999,313000.02239999996,0,140889.82250025551,20552.780467517881,70675.916554268741,123156.46658519606,148412.7240473523,21371.463773999996,123994.36279799997,316733.15078099992,19.140000000000004,17.070000000000004,12645.503523442449,2217.6089999999999,805.88800000000003,null,7046,257,253,267,256,283,279,null,0,0]
[643,"Habo",3013249.5,null,13092,13266,13299,13330,13360,13388,22.17,22.17,null,19.140000000000004,17.070000000000004,null,3021,2635,-2627.56238474869,-2267.4434936680072,13128,13275,1003,1592,236,1923,552,1810,523,77,957,1584,207,1978,561,1817,556,75,10879,10975,11110,11314,11586,11845,11845,12140,12433,12589,12810,13128,1863,1926,1978,2039,2124,2159,1027,1031,1039,1011,1002,1003,12104,12418,12577,12790,13092,null,137544.10151514388,22646.478346716132,70547.506554025822,124345.3951092615,148200.51037697124,17527.870619999998,117208.44953999999,321564.19594000001,81,143144.41135735865,22971.08586502503,72702.006768163134,126953.39664629484,147856.06712345418,18053.913158999996,113895.30261599997,336277.1062349999,19.140000000000004,17.070000000000004,17624.678132199973,1794.67,1488.951,null,10365,392,418,467,513,530,552,null,0,0]
[662,"Gislaved",6746764.7999999998,null,29508,29087,29159,29227,29292,29354,21.99,21.99,null,19.140000000000004,17.070000000000004,null,1140,870,524.35698379454004,551.01742651148197,29481,29014,1645,2606,362,3435,1129,4468,1481,350,1555,2463,312,3273,1163,4494,1569,344,28732,28713,28737,29272,29478,29629,29629,29857,29963,29635,29556,29481,3729,3801,3831,3794,3824,3797,1765,1783,1732,1715,1669,1645,29809,29962,29644,29558,29508,null,134511.79425571414,18416.000594828063,69734.269412165188,125828.03519012523,142863.43968343531,21060.442519999997,127247.70318,331726.46363999997,0,140090.6015875875,18681.793784346559,71825.952285957159,128107.95597593399,142006.27761935384,21486.721400999995,127585.00130399998,334386.25813799992,19.140000000000004,17.070000000000004,24860.624609727136,8316.3559999999998,1213.941,null,29333,1131,1178,1176,1155,1132,1129,null,0,0]
[665,"Vaggeryd",3405020.2,null,14856,14816,14853,14888,14921,14953,21.49,21.49,null,19.140000000000004,17.070000000000004,null,208,395,108.43844784043399,57.202124282166551,14854,14811,1003,1392,226,1759,554,2167,657,135,990,1396,195,1769,565,2166,690,132,13148,13209,13229,13372,13644,13840,13840,13980,14275,14532,14746,14854,1827,1857,1906,1898,1926,1985,897,892,949,968,1012,1003,13946,14226,14483,14701,14856,null,135691.13693580896,20407.027492802583,71171.055547369455,126585.076522876,145078.1014888284,20331.06712,124799.39679999999,337503.76997999998,0,141562.81290615484,20708.73547551599,73337.350721413066,129274.05617213772,146404.04180314185,20436.942473999996,125553.97501199997,341518.73237099993,19.140000000000004,17.070000000000004,21304.626474611257,3895.0659999999998,1552.384,null,12930,471,482,520,553,558,554,null,0,0]
[680,"Jönköping",35082257.799999997,null,144947,146330,146691,147032,147361,147673,21.64,21.64,null,19.140000000000004,17.070000000000004,null,-2934,-2962,589.34204083695602,577.37662925558016,145114,146161,8259,12308,1733,15774,4917,19416,6564,1507,8141,12135,1660,15827,5089,19350,6904,1512,129478,130798,132140,133310,135297,137481,137481,139222,141081,142427,143579,145114,16103,16545,16857,17042,17235,17507,8439,8352,8398,8389,8336,8259,139147,140946,142471,143494,144947,null,134383.21272346252,21293.679566400515,68139.770308753883,121527.29630097882,131378.18672558825,21344.572339999999,124243.11197999999,331973.58038,0,140126.23790602834,21605.715556861054,70207.654901944552,123960.98648781051,130602.60800043021,21597.825599999996,124473.04537499997,333882.65499299992,19.140000000000004,17.070000000000004,124608.91600498762,10402.11,14292.852999999999,null,123500,4364,4442,4535,4726,4806,4917,null,0,0]
[682,"Nässjö",6806148.4000000004,null,31902,31637,31715,31789,31860,31927,22.54,22.54,null,19.140000000000004,17.070000000000004,null,2023,2049,2238.6090730740102,2747.6177940996558,31944,31648,2050,2852,394,3605,1191,5021,1515,383,1941,2862,420,3542,1189,4959,1599,370,29382,29516,29907,30451,30820,31178,31178,31477,31538,31563,31782,31944,3765,3836,3837,3930,3964,3999,1971,2084,2103,2059,2071,2050,31465,31527,31554,31731,31902,null,136906.15982308501,19924.98031253169,69536.392228846395,125416.51684499995,142152.21408180983,21836.628579999997,123236.13847999999,338856.92463999998,0,142568.44701625701,20213.21211238431,71650.152235315079,127920.17981774855,141939.7654383312,22483.544120999995,124093.00671299997,339183.46747799992,19.140000000000004,17.070000000000004,38061.917571673686,8517.2710000000006,2562.48,null,29413,1109,1136,1156,1150,1186,1191,null,0,0]
[683,"Värnamo",8447670.4000000004,null,34700,34619,34704,34785,34863,34937,21.52,21.52,null,19.140000000000004,17.070000000000004,null,-1300,-1443,1181.26985989121,1144.8028372915433,34692,34601,1919,2934,399,3793,1268,5493,1807,373,1882,2888,409,3787,1210,5561,1859,390,33012,33155,33334,33473,33906,34206,34206,34428,34560,34530,34661,34692,4150,4155,4200,4180,4227,4192,1950,1952,1982,1947,1941,1919,34372,34576,34540,34651,34700,null,133773.5297065351,19892.215005678965,69975.775202007891,125434.40642231307,134492.47190538354,21039.758739999997,129261.65018,344747.44746,0,139541.79533595609,20185.26790346437,72107.65901094189,127864.28848735041,135312.90900448826,21222.978722999997,128331.57998699998,345093.79552199994,19.140000000000004,17.070000000000004,38030.280032786613,6495.7449999999999,3147.5039999999999,null,32911,1161,1250,1278,1307,1266,1268,null,0,0]
[684,"Sävsjö",2393400.5,null,11759,11668,11697,11724,11750,11775,21.92,21.92,null,19.140000000000004,17.070000000000004,null,4534,4912,1336.0923426576101,818.74673053318838,11771,11668,752,1050,164,1359,441,1965,634,165,741,1052,152,1364,442,1945,652,165,10844,10969,11100,11228,11396,11496,11496,11631,11677,11721,11709,11771,1477,1465,1514,1513,1488,1523,708,732,736,744,761,752,11581,11661,11720,11705,11759,null,135870.76450827293,19797.427179319322,70953.246515372462,127801.49256488468,149944.27982404138,20774.135459999998,132283.6593,350123.05301999999,0,141802.04896383767,20091.435062123262,73119.58252448088,130274.88256772232,148408.40536083371,20974.811399999995,134216.98746299997,354796.20332999993,19.140000000000004,17.070000000000004,13291.630410726108,3955.0439999999999,278.44,null,10962,383,432,439,471,448,441,null,0,0]
[685,"Vetlanda",6053472.5,null,27685,27501,27569,27633,27695,27754,22.01,22.01,null,19.140000000000004,17.070000000000004,null,2210,2207,353.08687897587401,397.55093420823869,27673,27498,1571,2451,347,3149,963,4805,1587,393,1503,2375,294,3170,938,4788,1629,389,26297,26419,26647,26873,27241,27415,27415,27504,27466,27502,27621,27673,3252,3276,3326,3360,3453,3496,1623,1598,1585,1573,1598,1571,27477,27467,27502,27602,27685,null,134632.93733243091,19777.261381886536,70923.548990510841,126772.58039455609,142697.66234741086,21282.520999999997,124107.03447999999,338546.66793999996,0,140245.91888478489,20063.543798936797,73085.655019517028,129372.76494826993,143532.04703865072,21833.532638999994,124998.45401699997,343295.36119799991,19.140000000000004,17.070000000000004,32594.598577826426,7045.058,1594.4870000000001,null,26378,987,985,954,951,945,963,null,0,0]
[686,"Eksjö",3989929.8,null,17894,17796,17840,17881,17921,17959,22.26,22.26,null,19.140000000000004,17.070000000000004,null,1688,2639,3136.2441946859499,3101.6108524112997,17858,17750,1003,1469,225,1871,598,3282,1023,256,986,1502,195,1929,615,3299,1052,254,16368,16464,16598,16790,17129,17416,17416,17667,17753,17788,17834,17858,1933,1965,1997,2044,2071,2096,1013,1055,1029,1006,1003,1003,17637,17736,17794,17846,17894,null,136117.30151712298,20692.377710796154,71459.068513217149,127508.9530515084,147032.18280656444,21738.652779999997,127588.44123999999,327296.86885999999,0,142048.55515575732,20999.71135347903,73657.147943344535,130164.69787021269,146900.25428475588,21936.329981999996,128073.02909399997,331527.66131699993,19.140000000000004,17.070000000000004,21632.93104074612,4579.3220000000001,1385.2729999999999,null,16470,584,620,653,611,602,598,null,0,0]
[687,"Tranås",4047620.7,null,18837,18775,18821,18865,18907,18947,22.01,22.01,null,19.140000000000004,17.070000000000004,null,1904,1883,1467.45296525302,1365.5961163009924,18804,18755,1061,1487,201,1949,713,3210,1196,282,1068,1486,212,1929,686,3183,1242,280,18145,18197,18416,18546,18794,18894,18894,18987,19003,18903,18874,18804,2254,2317,2303,2255,2202,2150,1036,997,1047,1029,1045,1061,18972,18976,18908,18856,18837,null,135239.73892019791,20185.715968241391,69023.117590219495,122963.80598857596,139421.35762134317,21513.308439999997,125832.49717999999,327800.89992,0,141302.13093324803,20489.478332297345,71119.380521784857,125468.23613312615,138740.25726504833,21898.949129999994,125962.04931299997,330101.99715599994,19.140000000000004,17.070000000000004,20403.369667808362,3645.232,1645.057,null,17911,641,670,682,706,697,713,null,0,0]
[760,"Uppvidinge",1972988.8,null,9439,9300,9323,9345,9366,9386,21.8,21.8,null,19.77,17.7,null,5020,5128,-327.86597895324502,131.15973035186653,9418,9263,526,794,126,1005,311,1630,537,142,523,750,95,972,319,1621,558,138,9276,9288,9222,9319,9508,9561,9561,9581,9588,9498,9449,9418,1095,1101,1106,1134,1115,1131,514,544,565,568,536,526,9560,9594,9503,9428,9439,null,134515.42632163133,18447.249595192836,72884.987141208388,131337.53185860979,157063.18708126,22818.563819999999,129655.73061999999,340799.02271999995,0,140560.01113670669,18724.507581068287,75075.488950076455,133572.05159981633,158361.64012956136,22841.777285999993,128987.82161099996,349534.84841099993,19.77,17.7,9090.9190545932597,5008.0519999999997,118.968,null,9477,363,355,370,341,324,311,null,0,0]
[761,"Lessebo",1663976.4,null,8521,8405,8426,8446,8465,8483,21.81,21.81,null,19.77,17.7,null,6171,6320,64.476083298728597,810.83617592264,8485,8342,513,781,138,990,338,1550,440,106,468,753,107,1012,327,1512,476,106,8012,8059,8256,8516,8760,8806,8806,8780,8733,8655,8574,8485,1188,1198,1197,1142,1161,1128,582,591,576,576,549,513,8815,8706,8649,8600,8521,null,138789.43712381477,19759.598244426037,71073.491663445981,129040.15847431426,161086.97213055191,21917.186459999997,125372.01091999999,330277.51041999995,0,144262.36920702603,20038.454914798793,73254.307200355586,131758.56476794792,160016.06100805374,22647.604526999996,127269.34077599997,326918.3945939999,19.77,17.7,8025.9844838473291,3350.2840000000001,345.45699999999999,null,8049,349,344,336,346,331,338,null,0,0]
[763,"Tingsryd",2528203.2999999998,null,12313,12156,12186,12214,12241,12267,22,22,null,19.77,17.7,null,3495,3955,2586.0302295658098,2703.9775715354363,12297,12155,624,943,135,1185,394,2491,821,207,602,907,117,1190,387,2472,853,203,12141,12156,12198,12260,12393,12451,12451,12407,12393,12369,12319,12297,1303,1314,1309,1343,1325,1320,637,621,642,626,626,624,12408,12384,12387,12346,12313,null,133859.30268694923,18673.934849321886,73869.429931830397,130662.82302618011,156290.96428444507,22861.019999999997,131858.00887999998,349944.51934,0,139573.38497120119,18947.588367110082,76124.233803340161,133497.82154578596,158698.33604472631,23278.925582999993,134288.63409599997,349438.28120999993,19.77,17.7,13721.895266095094,6406.2550000000001,389.27699999999999,null,12580,420,424,409,398,391,394,null,0,0]
[764,"Alvesta",4207157.2,null,20276,20138,20188,20235,20280,20323,21.42,21.42,null,19.77,17.7,null,3993,3697,184.29695070042101,384.22037054158682,20257,20040,1267,1897,305,2408,806,3334,1001,288,1190,1849,265,2385,781,3315,1065,281,19034,19280,19503,19581,19850,20026,20026,20150,20134,20224,20287,20257,2589,2610,2681,2694,2694,2713,1343,1384,1350,1332,1330,1267,20114,20179,20217,20302,20276,null,137266.66623172298,20112.14643636682,70099.771547359429,126335.7897275857,149243.71577807001,20258.129579999997,126396.40233999999,330921.97345999995,0,142878.50538418596,20400.940020080718,72228.621941087404,128855.5074813292,146662.22138375818,20551.161743999994,125087.75271899997,333622.02738599991,19.77,17.7,26305.406072660786,6291.6139999999996,1515.2539999999999,null,18768,691,724,726,788,779,806,null,0,0]
[765,"Älmhult",4456261.5999999996,null,18039,17997,18041,18083,18123,18161,21.86,21.86,null,19.77,17.7,null,3796,3473,-448.54171636090501,-672.79942204523104,18092,17932,1159,1830,249,2320,627,2588,809,212,1102,1790,250,2282,627,2547,845,224,15724,15759,15908,16168,16618,17148,17148,17568,17651,17884,17963,18092,2188,2331,2408,2483,2501,2569,1156,1212,1164,1180,1151,1159,17502,17643,17901,17932,18039,null,138433.43875605971,20414.121503571329,71151.474936919883,129383.0671658967,145474.39120951999,21335.863379999999,129863.65703999999,340838.21304,0,144176.26296996285,20709.332502593206,73313.791741398687,131839.00061457561,143515.72260157336,21696.469514999993,128585.97745199996,337319.61666299991,19.77,17.7,22810.644941835053,4591.5940000000001,1380.191,null,15364,578,578,606,606,650,627,null,0,0]
[767,"Markaryd",2115984.2000000002,null,10184,10107,10132,10156,10179,10201,21.31,21.31,null,19.77,17.7,null,1844,1602,992.70341743002598,1307.3013359902479,10166,10076,541,816,131,1070,344,1827,610,143,499,793,108,1067,340,1773,636,138,9477,9515,9549,9779,9991,10170,10170,10260,10320,10373,10320,10166,1162,1198,1213,1226,1209,1201,569,606,608,608,599,541,10218,10301,10365,10354,10184,null,135830.13261050507,18761.742623997452,70090.797555628116,126043.65949603397,150480.54506139466,21646.120079999997,125753.02791999999,331946.36487999995,0,141156.55424455286,19025.88636783004,72219.134647936356,128348.28920932241,151971.76212821392,21647.666735999996,127574.61773399997,342564.35786999989,19.77,17.7,8956.2528582430405,6462.45,280.25900000000001,null,9627,336,346,334,348,348,344,null,0,0]
[780,"Växjö",22567835.300000001,null,97081,97600,97841,98068,98287,98495,20.190000000000001,20.190000000000001,null,19.77,17.7,null,-2140,-1929,620.85918619843198,696.88141804747283,97137,97574,5840,8336,1199,10640,3467,13162,4240,898,5797,8242,1113,10720,3515,13144,4551,913,84800,85822,86970,88108,89500,91060,91060,92567,94129,94859,95995,97137,10945,11273,11551,11611,11772,11839,5705,5655,5670,5724,5820,5840,92271,93991,94796,95846,97081,null,136397.91306407587,21593.620997397036,69074.425164684842,123570.35884947948,134765.23764090962,21621.081819999999,123307.9874,329984.67163999996,0,142302.11584403933,21912.290081133833,71175.154235868758,126143.2212095705,135461.49613451352,21756.694220999994,123303.85539299998,329703.26806799992,19.77,17.7,90641.146829362784,10690.632,8777.8719999999994,null,79458,2992,3055,3204,3260,3314,3467,null,0,0]
[781,"Ljungby",6438761.2000000002,null,28404,28325,28395,28461,28525,28585,21.07,21.07,null,19.77,17.7,null,-471,-876,1836.6501519809001,2051.5836830522467,28483,28304,1534,2194,305,2896,1024,4855,1632,396,1422,2216,347,2841,1017,4853,1688,388,27423,27277,27522,27638,28008,28297,28297,28573,28521,28401,28433,28483,3221,3219,3231,3207,3220,3201,1496,1591,1560,1543,1542,1534,28509,28492,28429,28435,28404,null,133332.43959233369,20236.554071121343,70631.254771386666,125849.2797738838,141214.58629521847,21283.609619999999,127843.17831999999,337438.45277999999,0,138595.50642655857,20523.244276927067,72776.596795611986,128289.94920838563,142013.64648756006,21582.250244999996,127333.71890999997,339297.68674799992,19.77,17.7,33381.058583895436,7578.3389999999999,2279.2570000000001,null,27285,890,911,947,1007,998,1024,null,0,0]
[821,"Högsby",1051320.8,null,5590,5469,5482,5495,5507,5519,22.21,22.21,null,20.36,18.29,null,8378,8831,1354.8048078918,836.91061903983973,5584,5438,265,467,62,599,196,1171,348,60,239,440,60,584,176,1208,348,64,5730,5718,5782,5857,6080,6087,6087,6094,5921,5731,5645,5584,714,750,717,681,697,661,345,337,327,299,287,265,6087,5918,5766,5627,5590,null,136446.12543086539,18254.883659823488,73033.028315022209,132086.25559307251,159016.63618404389,25277.756399999998,139232.32076,369279.49915999995,0,141706.26212391211,18509.272877599564,75256.620942120033,134506.29318857309,160145.55829242035,24913.299500999994,140588.34601499996,377221.59945899993,20.36,18.29,4580.4643606043828,2755.7060000000001,40.317,null,5943,230,218,212,187,181,196,null,0,0]
[834,"Torsås",1457305.7,null,7047,7027,7044,7060,7076,7091,21.43,21.93,null,20.36,18.29,null,375,-518,362.70729876136801,275.33702598356467,7042,7002,339,496,64,655,257,1555,433,82,313,478,74,633,244,1537,454,79,6858,6879,6925,6943,7063,7083,7083,7098,7125,7149,7113,7042,771,779,772,767,769,719,335,357,359,355,348,339,7091,7104,7140,7126,7047,null,134200.43769198464,19959.034601395771,72405.295886659398,127185.28089226739,159650.02881017857,22754.335239999997,135830.38326,360543.32365999999,0,139394.5730376064,20237.913029492775,74588.694725806039,129448.32015463733,159177.55396424819,22878.119780999994,134773.54681499998,352255.34375099989,20.36,18.29,9464.888045510661,4173.1610000000001,137.81399999999999,null,7131,244,242,239,253,254,257,null,0,0]
[840,"Mörbylånga",3583634.6,null,15969,16119,16159,16197,16233,16267,22.21,22.21,null,20.36,18.29,null,-710,-1106,1276.0523422316501,1064.2198341200756,15985,16144,958,1375,178,1790,534,3469,925,145,867,1420,229,1811,555,3470,1017,132,14256,14368,14498,14669,14916,15000,15000,15048,15249,15487,15722,15985,1854,1872,1900,1929,1963,1968,899,902,910,912,912,958,15011,15225,15429,15689,15969,null,136617.83812823321,22850.754215899789,70815.433141951871,124192.2153959209,143598.93920784691,20669.627939999998,129146.25645999999,334593.88871999999,0,141697.26509793586,23166.533663170812,72984.537763821689,126686.66347715219,141773.50218188329,20774.408498999994,126030.58087499997,337906.28836799989,20.36,18.29,37709.755594840615,7738.2879999999996,2976.835,null,13597,468,473,480,481,487,534,null,0,0]
[860,"Hultsfred",2752662.8,null,14090,13902,13936,13968,13999,14029,21.91,21.91,null,20.36,18.29,null,5335,5487,3622.2392708125099,3333.2909723490347,14064,13883,750,1181,166,1528,451,2730,894,204,712,1123,143,1497,462,2763,929,200,13550,13635,13738,13919,14607,14579,14579,14360,14224,14107,14056,14064,1605,1577,1603,1579,1615,1694,841,810,801,768,765,750,14374,14245,14163,14042,14090,null,134386.5984316385,19192.748787000997,71289.461955286693,128354.08824975067,155632.51240054012,22265.544859999998,135707.36919999999,350325.53633999999,0,139976.0051720191,19469.938209546432,73446.531356147621,130667.87593939698,154038.01271558439,22410.859130999994,135101.66762699996,350275.19695199991,20.36,18.29,10194.928865756061,5350.92,33.863999999999997,null,14210,470,491,469,476,469,451,null,0,0]
[861,"Mönsterås",2927609.6,null,13289,13164,13196,13227,13257,13285,22.21,22.21,null,20.36,18.29,null,1212,956,1957.5993301610299,2984.5482873187893,13276,13134,708,1085,138,1360,434,2594,841,166,672,1054,148,1333,433,2594,878,158,12799,12949,13057,13144,13395,13498,13498,13565,13430,13264,13258,13276,1456,1513,1507,1509,1502,1498,783,781,761,701,695,708,13565,13455,13312,13264,13289,null,133817.810583207,19697.90801391338,70921.908465013956,125819.82944708002,149875.62923342094,22257.924519999997,133514.88851999998,348899.44413999998,0,139361.43310554055,19982.420267544938,73075.941175955624,128072.75828051452,150437.88810153218,22698.484019999996,134342.62865999996,348867.18485999992,20.36,18.29,17182.433687696615,6107.4589999999998,902.64099999999996,null,13139,457,454,441,408,416,434,null,0,0]
[862,"Emmaboda",1955134.5,null,9341,9100,9122,9143,9163,9182,21.96,21.96,null,20.36,18.29,null,3723,3111,2306.8097162639901,2669.7821927349241,9347,9056,394,728,94,976,307,1825,652,136,358,712,89,921,307,1788,664,129,8991,8964,9009,9090,9348,9368,9368,9400,9445,9360,9329,9347,984,1000,1090,1071,1068,1070,508,498,458,456,420,394,9381,9450,9382,9339,9341,null,133356.38736398067,19291.958747655652,70650.546586208467,126380.50554248894,170306.07890310444,22310.17828,132577.58669999999,334543.81219999999,0,138605.0707602964,19564.948604464873,72776.149739167406,128590.02442982144,166350.41648990547,22876.043066999995,133617.85547399998,337985.20349999995,20.36,18.29,7172.2856040627394,3787.0210000000002,33.192,null,9373,315,315,327,332,317,307,null,0,0]
[880,"Kalmar",16899546,null,71979,72374,72552,72721,72884,73038,21.81,21.81,null,20.36,18.29,null,-3047,-2956,2176.4328632225802,2331.9580193191405,72018,72304,4048,5983,843,7621,2353,10515,3284,757,4066,5916,804,7663,2388,10491,3461,732,63671,63887,64676,65704,66571,67451,67451,68510,69467,70329,71328,72018,7412,7738,7921,8105,8307,8464,4033,4005,4034,4051,3990,4048,68416,69401,70367,71309,71979,null,134890.76285055716,21804.901885388084,68828.427127165545,122052.12395776458,131923.60725567656,22752.157999999999,128027.15509999999,336309.55383999995,0,140852.62758132527,22129.770285909122,70921.419780090466,124561.66014191366,132813.40389779457,23032.834973999994,128678.39122499997,333712.3644449999,20.36,18.29,65856.262785603089,10136.955,6870.3980000000001,null,61549,2120,2167,2175,2262,2282,2353,null,0,0]
[881,"Nybro",4103456.3,null,20294,20196,20246,20293,20338,20381,22.33,22.33,null,20.36,18.29,null,3127,3342,2236.5448405557399,2108.801947316414,20303,20145,1159,1659,256,2090,655,3515,1316,278,1098,1624,250,2096,694,3459,1357,263,19486,19489,19714,19754,20311,20406,20406,20350,20318,20273,20284,20303,2250,2288,2289,2328,2341,2346,1141,1182,1197,1152,1184,1159,20337,20317,20259,20262,20294,null,135565.61334119068,20092.461792380051,70231.948277465577,125410.98269777176,149682.93211611596,23461.938239999999,133680.35876,342607.22053999995,0,141145.3871216136,20381.971932056651,72377.170575955271,127967.76083492041,144445.47723423131,23978.778200999994,135252.22939199998,350014.56934499991,20.36,18.29,21152.308684515607,6359.991,956.61300000000006,null,19584,671,676,663,651,641,655,null,0,0]
[882,"Oskarshamn",6434130.2999999998,null,27063,26959,27025,27088,27149,27206,22.35,22.35,null,20.36,18.29,null,-405,-169,239.70734184984099,233.72227181519338,27028,26918,1439,2201,319,2789,958,4748,1659,298,1355,2169,294,2799,974,4669,1782,314,26144,26212,26301,26450,27006,26928,26928,26928,27102,27147,27220,27028,3028,3034,3069,3099,3107,3108,1475,1491,1502,1520,1510,1439,26926,27079,27123,27169,27063,null,132652.44638211778,20040.687054496069,69993.33379641299,124441.23959127533,140458.93142314549,21962.908499999998,129774.39019999999,343689.30881999998,0,138007.44324091738,20326.83396348789,72125.507857003948,126944.07178596038,140891.22168323753,21760.847648999996,128299.39091999998,341751.32433899993,20.36,18.29,31014.769751344567,5762.2389999999996,2413.98,null,26276,869,935,969,970,959,958,null,0,0]
[883,"Västervik",8042006.5,null,36682,36476,36566,36651,36733,36811,21.16,21.16,null,20.36,18.29,null,872,936,1758.2479371953,1472.7043175814551,36650,36434,1782,2702,358,3562,1134,7859,2539,560,1743,2665,354,3515,1150,7761,2682,552,35892,35867,35920,36049,36438,36551,36551,36680,36679,36655,36747,36650,3795,3853,3851,3870,3884,3920,1801,1788,1835,1801,1773,1782,36696,36721,36602,36721,36682,null,132391.09574799959,19996.499510762769,70441.294164836654,124187.5266612995,144405.57543350468,22459.319219999998,129378.13251999998,340097.95143999998,0,138134.83596912454,20292.085558456853,72576.836924578674,126738.82812179625,145219.40853259439,22695.368948999996,128902.67633699997,338889.61244699993,20.36,18.29,52870.296982483516,10711.828,3823.9180000000001,null,36433,1133,1153,1124,1172,1162,1134,null,0,0]
[884,"Vimmerby",3426511.6,null,15567,15496,15534,15570,15605,15638,22.36,22.36,null,20.36,18.29,null,182,331,1867.4091895479601,1765.5427592377882,15557,15461,818,1256,179,1582,530,2845,952,219,810,1231,156,1597,499,2829,976,226,15403,15287,15297,15419,15636,15728,15728,15764,15647,15672,15578,15557,1710,1774,1739,1744,1741,1761,864,851,857,834,828,818,15740,15655,15657,15566,15567,null,133382.89873902366,19851.204918366773,71555.181120254289,126753.1493469714,146550.82007862531,21698.37384,129209.39641999999,341671.00733999995,0,139271.99077271213,20146.953731851383,73739.299818630054,129402.06779899087,145489.43196711753,22010.053328999995,130273.30757699997,343480.18874399993,20.36,18.29,17123.54708338272,4804.9110000000001,824.02599999999995,null,15592,563,527,527,546,546,530,null,0,0]
[885,"Borgholm",2311043.2000000002,null,10880,10781,10808,10833,10857,10880,21.58,21.58,null,20.36,18.29,null,-807,-332,695.035108812614,852.5922640651097,10857,10748,416,615,77,830,304,2999,960,169,373,607,95,795,301,3008,1010,178,10768,10619,10681,10681,10930,10857,10857,10873,10839,10836,10895,10857,978,987,972,929,928,907,404,416,414,403,402,416,10890,10845,10833,10875,10880,null,130460.06530734809,19437.903052216057,74127.651873429597,129318.54173077621,150092.64148674329,22152.328379999999,128509.41376,341684.07077999995,0,135056.49524936907,19698.799710764539,76356.391242229089,131618.44390074469,153253.56307185048,22355.826209999996,129739.59207899997,343809.34791299992,20.36,18.29,52748.336474653108,11916.486999999999,3751.924,null,10959,353,346,305,313,309,304,null,308,0]
[980,"Gotland",13253562.5,null,61167,61093,61244,61386,61523,61653,33.6,33.6,null,19.600000000000001,17.54,null,-2706,-2053,-28.330369199079499,137.50101422460193,61173,61029,2873,4626,655,5967,1873,12014,3648,729,2730,4621,652,6079,1913,11989,3880,739,57241,57161,57255,57391,58003,58595,58595,59249,59686,60124,61001,61173,6162,6323,6401,6542,6567,6622,2936,2961,2942,2894,2922,2873,59126,59636,60050,60972,61167,null,131414.71066798785,20454.970986848275,71766.670299224206,125351.42238231392,143050.34631560484,23490.242359999997,129033.03997999999,337993.64898,0,136777.89657444184,20748.830174005117,73968.772442533387,128050.35070240691,142980.12104637141,23810.564366999995,129417.70140899997,341487.58166099992,19.600000000000001,17.54,121868.44757412917,21003.695,11316.089,null,57132,1773,1797,1828,1809,1829,1873,null,1316,0]
[1060,"Olofström",2891744.3,null,13204,13091,13123,13154,13183,13211,21.71,21.71,null,19.11,17.040000000000003,null,1359,1384,2042.4160376694999,2097.7704478682072,13159,13061,621,994,142,1259,437,2384,940,202,597,961,124,1277,422,2356,968,204,12896,12902,13031,13170,13417,13482,13482,13516,13426,13311,13263,13159,1433,1481,1445,1422,1389,1401,684,692,704,664,659,621,13492,13444,13343,13280,13204,null,133528.96154774289,19449.457831113483,68843.377694879789,123500.31971536239,150642.80327912534,22440.812679999999,127050.66295999999,349017.01509999996,0,139154.84168548457,19732.280007864938,70950.134084133766,126027.47346354772,151017.43945697302,22937.306129999994,127879.89469199997,345493.56296699989,19.11,17.040000000000003,9162.7041382271309,3896.1109999999999,173.874,null,13243,420,433,428,424,458,437,null,0,0]
[1080,"Karlskrona",15773898.199999999,null,66704,66576,66740,66895,67045,67187,21.65,21.65,null,19.11,17.040000000000003,null,-2177,-2164,1670.7335055122301,2032.0855701794799,66682,66420,3390,5419,754,7057,2471,10716,3523,709,3319,5253,692,6951,2459,10644,3718,722,63691,63912,64348,65380,66262,66666,66666,66675,66622,66515,66708,66682,8006,7972,7965,7929,7879,7811,3729,3674,3650,3490,3479,3390,66720,66750,66605,66698,66704,null,134230.3228506367,22058.561597764354,69001.062136239721,122104.24965775915,137626.96844992545,22072.859119999997,126139.48801999999,332315.40706,0,140022.31380030999,22382.581243600463,71087.054691554309,124452.83870219796,137961.5515364942,22399.437203999994,127239.22842299996,334423.63898999995,19.11,17.040000000000003,76345.182164581973,12871.397000000001,7116.1970000000001,null,62329,2160,2236,2281,2400,2432,2471,null,0,0]
[1081,"Ronneby",6014828,null,29229,29072,29144,29212,29277,29339,21.81,21.64,null,19.11,17.040000000000003,null,4296,4062,500.63237224031701,815.10954771343404,29169,29021,1661,2468,340,3217,1075,5171,1795,401,1592,2444,355,3183,1103,5111,1883,376,27788,27871,28221,28697,29207,29568,29568,29695,29633,29372,29200,29169,3531,3618,3690,3665,3648,3557,1701,1743,1754,1715,1673,1661,29668,29663,29421,29216,29229,null,136562.5585748076,20537.066642736187,69704.359193903321,124927.00438674922,147140.11784856289,22376.5841,127124.68912,342038.96089999995,0,142269.7993141379,20835.185295156396,71823.756782722441,127433.39300297754,145338.66602475871,22728.596372999993,127641.07258199996,341624.64478499989,19.11,17.040000000000003,35298.61714094771,10509.439,2441.643,null,28479,992,1004,973,998,950,1075,null,0,0]
[1082,"Karlshamn",7286660.4000000004,null,32224,32023,32102,32177,32249,32317,22.33,22.23,null,19.11,17.040000000000003,null,-499,22,2305.0441395696098,2982.3861979306939,32216,31996,1598,2564,351,3315,1073,5709,2035,400,1563,2508,342,3271,1094,5622,2157,426,31132,31272,31598,31846,32130,32200,32200,32330,32473,32402,32226,32216,3560,3616,3666,3673,3672,3666,1715,1733,1696,1666,1622,1598,32353,32443,32433,32283,32224,null,133954.28631028777,21009.521917695954,68195.508341811757,121166.72787009791,136448.65899403059,23014.51542,129313.90393999999,335654.2046,0,139765.38104083083,21319.434494525089,70263.505983621872,123594.03651622849,135178.75100490672,23225.969375999994,129298.29035399997,338101.49948399991,19.11,17.040000000000003,38102.722347894298,6865.8980000000001,2953.681,null,31066,1001,1022,1049,1069,1089,1073,null,0,0]
[1083,"Sölvesborg",4049711.1,null,17515,17464,17507,17548,17587,17624,21.82,21.82,null,19.11,17.040000000000003,null,-2120,-1832,1096.67575481012,1157.3927963403285,17514,17475,780,1332,179,1730,606,3386,1117,203,759,1295,148,1740,593,3380,1201,197,16808,16800,16959,17160,17437,17455,17455,17468,17452,17456,17540,17514,1939,1944,1954,1916,1900,1909,926,872,836,820,787,780,17465,17448,17425,17522,17515,null,134065.71976740233,20100.259362289013,69140.379577369094,121354.7897014177,142436.2929680323,21880.17338,129754.79504,336608.92433999997,0,139793.92259842419,20394.103669465341,71241.639778447206,123882.11954582142,143210.41862044943,22070.278034999996,130039.67725199996,335659.2838199999,19.11,17.040000000000003,32620.68024926227,7045.473,2345.0590000000002,null,16820,563,571,579,588,614,606,null,0,0]
[1214,"Svalöv",3193877.5,null,14480,14523,14559,14593,14626,14657,20.74,20.74,null,19.7,17.63,null,223,20,-907.20224149196804,-1008.7690891563834,14466,14544,938,1373,212,1715,526,1996,541,120,928,1366,196,1749,515,2021,582,108,13275,13332,13460,13655,13919,14025,14025,14123,14268,14276,14412,14466,1817,1822,1862,1856,1855,1927,885,925,959,956,951,938,14128,14267,14277,14365,14480,null,137725.54769954245,21120.466354599699,70410.203840610891,125485.60783103816,147959.70083313819,22469.1168,132269.50723999998,348380.17239999998,0,143642.40095722632,21431.05928014973,72560.476883794341,127912.11731427588,147883.91871829075,22867.736210999996,131045.84518499997,343725.24099599989,19.7,17.63,19755.483623769611,4839.7120000000004,1486.873,null,13142,515,511,512,533,534,526,null,0,0]
[1230,"Staffanstorp",6881152.9000000004,null,26652,27076,27143,27206,27267,27325,19.09,19.09,null,19.7,17.63,null,3542,3550,-2691.3512409985801,-2736.6769128785559,26778,27152,1869,3013,449,3774,1087,3197,1338,215,1809,2962,385,3847,1131,3158,1414,238,22534,22672,22994,23119,23600,24167,24167,24724,25396,25883,26242,26778,3629,3711,3841,3990,4055,4223,1766,1790,1896,1891,1873,1869,24633,25296,25863,26242,26652,null,141044.09746734222,24654.197893838926,68814.364607491269,122635.31474264318,129315.38367561866,20009.924219999997,115374.12483999999,313120.85921999998,250,146855.78232917006,25008.940242207191,70907.899256045072,125246.52126823904,129588.57812405082,20648.767301999997,116618.91302699997,311468.6807909999,19.7,17.63,25211.604529232412,1653.28,3231.2779999999998,null,21093,917,955,976,1019,1045,1087,null,0,0]
[1231,"Burlöv",4209884.0999999996,null,19899,19853,19902,19948,19993,20035,20.09,20.09,null,19.7,17.63,null,2591,2894,-2997.9900532034899,-3279.5578226578355,19882,19844,1364,1921,269,2392,688,2444,784,153,1309,1906,284,2399,709,2429,823,153,17011,17114,17211,17430,17646,18073,18073,18360,19112,19312,19753,19882,2411,2447,2510,2536,2649,2661,1267,1283,1385,1386,1400,1364,18346,18993,19211,19757,19899,null,142049.58325589544,21709.872272819379,67821.490807844748,124153.81843958463,132177.57487294858,24861.903559999999,131510.73909999998,336800.52145999996,0,147968.63134943688,22024.677145156624,69892.406877716305,126633.87555321619,132074.44292320716,25107.472259999995,131948.17741799998,345367.9217699999,19.7,17.63,13072.467081855009,929.04600000000005,1797.923,null,15858,679,659,706,691,699,688,null,0,0]
[1233,"Vellinge",11792644.4,null,37867,37809,37902,37990,38075,38155,18.5,18.5,null,19.7,17.63,null,823,1633,-2781.5912183212099,-2767.2047618469537,37821,37738,2198,3708,536,4736,1581,6149,2169,354,2192,3650,469,4799,1569,6027,2375,370,33615,33807,34110,34667,35257,35790,35790,36499,36628,36915,37452,37821,5006,5142,5121,5160,5231,5272,2200,2245,2189,2224,2218,2198,36494,36637,36888,37445,37867,null,140631.34027513457,24977.555402054761,69901.486576701238,122696.06104314797,125048.17226922688,19046.49552,117926.93874,332755.20953999995,0,146809.07563845254,25347.543452056692,72035.171415755278,125186.06707936506,125543.61373898032,19308.248414999995,116664.60073499997,331263.91863899992,19.7,17.63,46279.723192611098,3279.2719999999999,6283.5320000000002,null,32575,1358,1429,1494,1512,1568,1581,null,0,0]
[1256,"Östra Göinge",2909397.1,null,14615,14372,14407,14440,14472,14503,20.99,20.99,null,19.7,17.63,null,5365,5429,1253.03417535262,914.12267740927473,14577,14331,872,1313,178,1714,585,2416,759,157,821,1266,158,1684,557,2364,819,159,13620,13687,13864,14102,14406,14715,14715,14915,15007,15017,14941,14577,1875,1959,2008,1991,1970,1892,852,889,919,957,930,872,14898,15009,14996,14967,14615,null,137098.2864342767,19599.207074415448,69935.881470586857,125582.94274950349,154584.44079045005,21832.274099999999,127687.50566,337670.32883999997,0,142775.11382285214,19882.179362377992,72060.160174933102,127870.41988556364,155039.28596523922,22290.409718999996,128429.18554499997,341700.44484599994,19.7,17.63,13838.572345215571,7707.3879999999999,442.22,null,13859,519,572,558,591,595,585,null,0,0]
[1257,"Örkelljunga",2167425.5,null,10471,10441,10467,10491,10514,10536,19.059999999999999,19.059999999999999,null,19.7,17.63,null,1645,1683,-839.253566404396,-615.08796771304151,10455,10433,558,838,124,1111,350,1809,546,129,540,850,111,1114,369,1776,580,124,9655,9653,9733,9831,9958,10047,10047,10174,10280,10451,10499,10455,1134,1178,1208,1240,1235,1235,553,554,545,566,560,558,10157,10287,10428,10459,10471,null,135513.08495685071,18940.837403351077,70881.766367134245,125678.42409407703,157411.52033472937,23321.506259999998,128871.92421999999,342716.08253999997,0,141243.54208115634,19217.988903261452,73037.518056595,128350.38699580055,156931.58575159695,23180.281667999996,133058.18105099996,340106.56685099989,19.7,17.63,13719.604696904786,6614.4459999999999,718.39499999999998,null,9572,305,341,346,362,356,350,null,0,0]
[1260,"Bjuv",3229704.1,null,16043,15983,16022,16059,16095,16129,20.99,20.99,null,19.7,17.63,null,1475,1505,-2121.2210624633999,-1924.3477412358543,16062,15968,964,1519,237,1943,629,2279,592,105,952,1490,196,1953,603,2216,645,100,14866,14801,14894,14962,15202,15429,15429,15501,15715,15697,15842,16062,2040,2074,2137,2117,2129,2180,952,945,992,984,990,964,15471,15690,15681,15760,16043,null,136628.1146007948,19324.062143608684,68939.992332528447,124576.30693865732,154106.39158842622,23003.629219999999,134021.09681999998,341819.05965999997,0,142592.30881441236,19610.380747755022,71038.687238591781,127364.42648845479,153734.70488651734,23263.350227999996,132555.61626299997,356893.68446999992,19.7,17.63,18892.879255401058,4617.8329999999996,1401.442,null,14442,583,587,609,619,623,629,null,0,0]
[1261,"Kävlinge",8742203.4000000004,null,32523,32447,32527,32603,32676,32745,18.510000000000002,18.510000000000002,null,19.7,17.63,null,750,1241,-2128.4951795828702,-2021.0945513119532,32470,32430,2039,3318,491,4253,1435,4484,1374,251,1954,3280,442,4283,1480,4376,1510,249,29427,29600,29808,30104,30532,30959,30959,31491,31705,32020,32341,32470,4660,4747,4772,4847,4785,4744,2078,2124,2096,2084,2106,2039,31387,31764,32066,32336,32523,null,139887.52021644518,24082.245794694118,68426.434792177446,120788.58568591415,130934.34995364817,20071.975559999999,120191.26834,322294.65995999996,0,145691.01872753573,24430.368354637001,70511.854232962665,123395.23906929235,129789.86038462768,20723.529005999993,122144.01062399997,326166.62412599992,19.7,17.63,39566.699946139146,3098.2849999999999,4411.9049999999997,null,27706,1103,1188,1249,1356,1400,1435,null,0,0]
[1262,"Lomma",8074110.9000000004,null,24712,24703,24764,24822,24878,24931,19.64,19.64,null,19.7,17.63,null,4450,4909,-2652.5109018277899,-2738.7123919138962,24721,24627,1297,2881,387,3751,1177,3471,1493,272,1292,2745,310,3751,1183,3374,1597,291,22298,22496,22946,23324,23887,24264,24264,24763,24834,24876,24638,24721,3901,4065,4154,4165,4154,4138,1741,1686,1589,1497,1415,1297,24653,24846,24911,24682,24712,null,142753.38142369693,26842.73992332898,69458.201275454325,122643.13374111812,119411.99766750989,18735.1502,112552.4218,308323.31088,0,149031.48150400422,27236.941402257271,71570.165513134765,125144.65749953547,118385.5893867112,19329.015554999994,112256.77526999997,309019.19662799995,19.7,17.63,26290.293189834712,1614.326,3141.7719999999999,null,19967,897,942,995,1075,1101,1177,null,342.24219999999991,0]
[1263,"Svedala",5634210.5,null,23266,23528,23586,23641,23694,23744,20.239999999999998,20.239999999999998,null,19.7,17.63,null,2591,3731,-2917.3512299907202,-2830.771470113782,23288,23470,1683,2642,372,3296,894,3021,888,171,1713,2607,337,3353,928,3061,926,184,19971,20067,20248,20462,20771,21074,21074,21576,22229,22665,23222,23288,3168,3298,3379,3473,3608,3668,1557,1517,1613,1680,1696,1683,21525,22113,22690,23075,23266,null,139492.46025344566,23194.001563939873,68828.91147371885,121998.83276841536,136267.81884492649,20524.841479999999,122047.36543999999,327512.41561999999,0,145633.31383357145,23538.368916983483,70927.636509021322,124591.06432771885,137133.85215670636,20901.088052999996,125753.33955599998,331024.05817199993,19.7,17.63,24351.767912836298,2138.6019999999999,2959.3209999999999,null,19104,779,804,850,889,893,894,null,0,0]
[1264,"Skurup",3753080.6,null,16652,16829,16870,16909,16947,16983,20.420000000000002,20.420000000000002,null,19.7,17.63,null,-1609,-834,-1458.07501705195,-1585.7907355244297,16731,16861,1036,1463,224,1837,583,2616,701,138,1034,1491,212,1875,613,2572,743,137,14955,15025,15167,15149,15408,15642,15642,15759,15889,16042,16419,16731,1949,1921,1959,1971,2007,2061,937,961,945,945,1009,1036,15739,15892,16030,16347,16652,null,136523.40266086016,20885.162489115632,69184.93629896568,122159.61349801415,142176.41067030805,22140.35356,130001.91177999999,331724.28639999998,0,142454.74402638644,21194.553918961145,71297.464779583344,124767.85572680166,143220.3690453842,22459.661909999995,128704.35014999997,332274.23999999993,19.7,17.63,21834.136392379522,3964.674,2207.9659999999999,null,14811,556,600,603,585,571,583,null,0,0]
[1265,"Sjöbo",4375500.7,null,19564,19464,19512,19557,19601,19642,20.92,20.92,null,19.7,17.63,null,-1471,-1496,-190.740683483287,-487.51032877843136,19547,19437,1075,1607,230,2029,594,3415,989,178,1056,1579,215,2010,616,3431,1025,168,18290,18401,18415,18514,18742,19071,19071,19153,19226,19412,19497,19547,2112,2131,2139,2207,2251,2259,1093,1107,1065,1099,1095,1075,19167,19207,19394,19469,19564,null,135087.90187379642,20418.67533478294,70583.543537464968,123824.8018500411,151708.55673252771,23062.414699999998,132737.61383999998,354821.53693999996,0,140956.65079062743,20720.593437821051,72724.841924788518,126373.38637865229,150758.96299231387,23418.065420999996,133386.30186299997,353793.15046799992,19.7,17.63,31427.447957000633,8274.36,2245.2370000000001,null,17960,596,627,656,647,606,594,null,0,0]
[1266,"Hörby",3490509,null,15733,15618,15657,15693,15728,15761,21.08,21.08,null,19.7,17.63,null,-33,45,-81.982591992009503,7.1444121636695854,15718,15585,875,1315,202,1652,526,2684,781,179,804,1300,197,1661,516,2685,816,181,14958,14917,14927,15020,15283,15552,15552,15635,15631,15653,15745,15718,1746,1775,1804,1805,1810,1854,944,966,926,935,924,875,15662,15660,15703,15735,15733,null,135068.54452784258,20853.498094469585,70535.615469863493,124399.12020773155,148061.17424536543,23381.380359999999,130123.83721999999,343014.36442,0,140345.67036325074,21147.112247245561,72692.817006434081,126924.73266206209,151927.5735499564,23778.375299999996,133710.26924699996,345931.74962099991,19.7,17.63,24077.453675488814,6013.9579999999996,1740.9970000000001,null,14610,498,504,489,505,518,526,null,0,0]
[1267,"Höör",3934132.1,null,17277,17325,17368,17408,17447,17484,21.75,21.75,null,19.7,17.63,null,-4,272,-1165.4573064864601,-928.11915003085687,17297,17376,1054,1585,208,2024,611,2760,789,175,1027,1576,234,2056,599,2734,868,168,15526,15637,15770,15970,16192,16478,16478,16637,16713,16830,16954,17297,2102,2166,2176,2176,2219,2232,1010,1015,1011,991,994,1054,16580,16733,16771,16933,17277,null,137003.82867820052,22595.638199776564,70266.267900656123,123742.12322440375,149512.32620959356,20874.288499999999,124399.87325999999,326269.21158,0,142778.36775299589,22924.735512030213,72419.117761222034,126273.27196897747,149730.17026682038,21065.148458999996,125447.02424099998,333760.12886699993,19.7,17.63,24889.57541825308,5540.0410000000002,2147.002,null,14888,580,581,591,607,614,611,null,0,0]
[1270,"Tomelilla",2828438.1,null,13793,13686,13720,13752,13783,13812,20.61,20.61,null,19.7,17.63,null,1616,1415,340.52756186747399,560.3467960736898,13812,13660,769,1109,155,1435,463,2619,818,160,695,1082,160,1400,482,2622,862,167,12917,12891,13007,13132,13330,13416,13416,13557,13617,13663,13712,13812,1507,1543,1586,1587,1590,1590,725,746,745,718,756,769,13507,13602,13684,13695,13793,null,135178.78778349052,19324.455355419435,70289.114834628737,124443.21547141753,161783.34629396684,21930.249899999999,128231.81565999999,329906.29099999997,0,140325.87255875813,19592.837979827505,72418.500393296548,126909.80671708657,157011.73470740003,22059.894464999994,128996.12846699997,339217.73325899994,19.7,17.63,22819.415246304503,5695.6149999999998,1405.65,null,12753,443,477,447,447,435,463,null,0,0]
[1272,"Bromölla",2719626.8,null,12628,12536,12567,12596,12624,12651,22.56,22.56,null,19.7,17.63,null,1066,997,-574.982745565713,-308.14935924615838,12633,12498,616,1069,160,1410,503,2274,742,109,599,1012,123,1374,503,2256,779,114,12250,12336,12400,12513,12625,12699,12699,12876,12870,12759,12650,12633,1571,1624,1645,1608,1594,1570,695,742,717,674,652,616,12848,12879,12762,12656,12628,null,134407.32402195362,20124.944918716661,68602.184388935828,122258.80590110621,143673.30569477932,21784.374819999997,131175.44413999998,329824.64449999999,0,140208.01324963802,20420.088520565732,70666.23004533918,124481.500339661,142707.29931419622,22132.579454999996,130313.80349999997,335833.7277959999,19.7,17.63,13903.23478360805,5413.4110000000001,861.68299999999999,null,12149,444,460,441,456,457,503,null,0,0]
[1273,"Osby",2834892.4,null,13227,13128,13160,13191,13221,13249,22.26,22.81,null,19.7,17.63,null,3499,3868,-262.08600085652103,-758.69148380100251,13238,13106,688,1175,143,1505,453,2371,835,197,642,1126,141,1482,473,2334,860,211,12637,12713,12828,12954,13149,13182,13182,13267,13208,13198,13269,13238,1543,1604,1591,1614,1613,1648,718,733,705,714,712,688,13255,13245,13201,13272,13227,null,134638.50169998396,19819.739241624658,69647.752117454249,124907.60032042883,140819.00921332801,21910.654739999998,125622.39352,334836.65097999998,0,140033.46457622459,20101.049860654053,71763.232933684107,127356.7768492373,139418.69108138105,22086.891746999994,125579.93393699997,331700.02857899992,19.7,17.63,15552.103314800715,5310.17,511.93700000000001,null,12609,451,431,447,458,470,453,null,0,0]
[1275,"Perstorp",1426341.1,null,7468,7361,7379,7396,7413,7429,20.81,20.81,null,19.7,17.63,null,7867,8162,-1818.5138232269501,-1926.1641990810913,7442,7323,452,664,94,909,288,1158,371,92,418,670,99,889,298,1149,398,87,7096,7139,7174,7211,7338,7335,7335,7479,7492,7476,7565,7442,906,946,955,969,1026,1003,422,448,457,446,460,452,7463,7501,7485,7524,7468,null,139468.43031461581,19283.121114669841,68668.054677068576,124863.09748907055,159768.7713557274,23943.108279999997,130361.15637999999,334936.80401999998,0,145101.03590044985,19559.014619161233,70757.302123521062,127222.50611532747,159474.8775855744,24860.343293999995,127835.24534099997,346970.10662099993,19.7,17.63,7023.0940881333145,2737.0320000000002,257.62200000000001,null,6910,274,280,273,273,270,288,null,0,0]
[1276,"Klippan",3712899.2,null,17861,17743,17787,17828,17868,17906,20.75,20.75,null,19.7,17.63,null,154,476,569.63968695414496,446.46618747064804,17865,17723,1018,1485,206,1852,620,2946,868,192,982,1409,187,1835,613,2936,906,199,16660,16715,16733,16917,17219,17462,17462,17600,17756,17738,17783,17865,1958,2032,2044,2069,2038,2058,978,946,982,988,985,1018,17591,17808,17697,17805,17861,null,136198.95373117065,19579.809901627217,69319.779980578678,123477.37981566082,151480.59366034725,23926.778979999999,130087.91275999999,329942.21545999998,0,141959.7850495108,19865.165268801979,71423.261394101442,125867.78569422125,152439.88628499306,24270.556517999994,134807.81259599997,331558.81202699995,19.7,17.63,22056.590771344447,6834.0770000000002,1296.5519999999999,null,16248,659,636,592,592,600,620,null,0,0]
[1277,"Åstorp",3303613.1,null,16325,16482,16523,16561,16598,16633,20.29,20.29,null,19.7,17.63,null,3353,3109,-2538.8423192774299,-2530.4719960663756,16341,16458,1061,1628,218,2117,722,2122,646,100,1075,1612,202,2135,709,2102,672,96,14806,14927,15061,15193,15528,15828,15828,15987,15940,16063,16308,16341,2253,2268,2300,2368,2393,2335,1072,1060,1046,1043,1068,1061,15956,15961,16028,16292,16325,null,137476.1964584603,20112.166748948272,68738.301958851313,124940.59193032248,145389.50359937464,22304.73518,126914.58545999999,343941.86865999998,0,143550.15736569976,20411.86227236925,70829.344904410071,127513.48569822118,144324.40795327254,23133.555602999993,131016.77118899996,338691.28625999991,19.7,17.63,17774.113625269427,4066.665,1534.867,null,14190,610,624,601,654,700,722,null,0,0]
[1278,"Båstad",4012928.7,null,15846,15870,15909,15946,15982,16016,20.23,20.23,null,19.7,17.63,null,200,802,-2325.24233238745,-2509.4302766272563,15824,15912,764,1115,158,1482,498,3550,1135,253,766,1091,138,1477,510,3543,1222,268,14263,14275,14419,14373,14614,14796,14796,14948,15128,15413,15636,15824,1507,1550,1570,1555,1604,1640,681,664,691,698,723,764,14878,15077,15377,15635,15846,null,134592.72220901283,21561.011691708754,70399.006891442114,124233.13312296492,140639.12739760792,21551.41014,124337.82191999999,335117.51493999996,0,140557.49469777971,21882.487770955198,72523.697275855826,126722.20224768715,139809.50184413252,21828.340853999995,123321.50746199997,337858.52394599991,19.7,17.63,38948.515290413023,3999.9645,4649.4084999999995,null,14237,448,450,436,471,481,498,null,0,0]
[1280,"Malmö",78773246.299999997,null,356670,361974,362866,363710,364524,365295,21.24,21.24,null,19.7,17.63,null,840,301,-612.70052322962397,-616.60676381078792,357377,362133,22372,29799,4360,37272,10748,39630,11712,2819,21921,29620,4233,37723,11139,40069,12175,2778,307758,312994,318107,322574,328494,333633,333633,339313,344166,347949,351749,357377,35919,37738,39102,40243,40998,41632,23328,23438,23192,22746,22560,22372,338582,343821,347744,351039,356670,null,141650.1638180766,21265.733829469882,67192.147965397482,122506.6030394167,130538.32858942814,26881.293659999999,137106.24589999998,340041.3432,179,147592.17681236338,21575.090337243422,69232.845025198243,124926.53997304643,128551.5189239685,27159.265691999994,137290.52418299997,342273.61790999991,19.7,17.63,166511.63786771597,13993.153,22561.562000000002,null,280279,9030,9207,9495,9816,10204,10748,null,31.644599999999969,0]
[1281,"Lund",31748744.800000001,null,128378,130506,130828,131132,131425,131703,21.24,21.24,null,19.7,17.63,null,-5205,-5584,164.729030610157,309.6370617553348,128384,130288,6035,10306,1382,13452,4262,16169,4906,1035,5905,10115,1273,13512,4351,16138,5313,1061,112950,114291,115968,116834,118542,121274,121274,122948,124935,125941,127376,128384,13802,14241,14505,14635,14757,14834,6860,6724,6664,6373,6185,6035,122949,124878,126042,127316,128378,null,138464.92051541049,24446.135390392436,67496.302514908952,120424.91751593963,126818.05864004613,23248.568719999999,123851.20877999999,324832.23317999998,0,144236.67094035345,24798.810538840611,69536.233800641945,122976.69861379924,126158.72468800616,23410.796921999994,125308.92275999997,323669.37554099993,19.7,17.63,94139.807647689784,7226.8490000000002,11403.046,null,105199,3478,3737,3910,4073,4126,4262,null,0,0]
[1282,"Landskrona",10048213.199999999,null,46956,47167,47283,47393,47499,47599,20.239999999999998,20.239999999999998,null,19.7,17.63,null,1252,1076,-530.68123137420503,-386.28921940829059,47004,47134,2899,4155,589,5267,1552,7276,2100,406,2690,4198,660,5246,1617,7231,2273,399,42560,43073,43574,43961,44611,45286,45286,45775,46090,46305,46488,47004,5286,5414,5526,5649,5785,5856,3011,3050,2975,2978,2927,2899,45671,46005,46317,46402,46956,null,138040.80585958381,20050.712389875378,67858.836566138751,123105.73224776685,138173.20809788807,24152.123319999999,131917.88297999999,345878.52363999997,0,143468.0948851158,20333.940064954157,69924.654165317494,125549.95106568866,137184.12500967289,24665.132177999993,129950.37854999996,342431.4481739999,19.7,17.63,39308.140133085879,3712.8890000000001,4525.3760000000002,null,40321,1502,1536,1547,1549,1503,1552,null,0,0]
[1283,"Helsingborg",36423615.5,null,150728,151403,151776,152129,152469,152791,20.21,20.21,null,19.7,17.63,null,637,828,-1106.1544105103401,-1158.1107010295627,150975,151306,8738,12836,1802,16473,5296,20876,6368,1407,8529,12641,1718,16567,5394,20730,6844,1407,132011,132989,135344,137909,140547,143304,143304,145415,147734,149280,150109,150975,16527,17091,17530,17889,18102,18275,8726,8774,8900,8924,8845,8738,145231,147445,149290,150187,150728,null,138062.20549800881,21351.016927899502,67784.82233098369,122784.75591915358,132764.52869761715,24737.800879999999,132891.10926,340546.46287999995,0,143918.49165850971,21662.970977042129,69848.28712230736,125396.31509426927,131874.4131556795,24991.176275999995,132743.55887999997,345928.6345499999,19.7,17.63,104762.06334742674,9191.9689999999991,13228.504999999999,null,124751,4723,4812,4924,4999,5140,5296,null,0,0]
[1284,"Höganäs",7075147.4000000004,null,28106,28209,28279,28345,28408,28468,19.73,19.73,null,19.7,17.63,null,-551,305,-1131.4104876762501,-1318.4910254054885,28103,28193,1421,2373,329,3149,1037,5497,1780,335,1399,2357,313,3148,1086,5504,1881,363,24863,25084,25298,25610,25847,26193,26193,26566,26942,27168,27589,28103,3289,3379,3420,3430,3433,3478,1422,1425,1383,1385,1409,1421,26473,26869,27100,27435,28106,null,135919.98804716187,22793.654452863862,68287.845858293702,120424.06005746043,130786.64697795868,20309.294719999998,117584.02343999999,329033.21775999997,0,141770.70423677942,23128.551726559053,70360.886665421363,122894.75392938506,130211.44085845217,20690.301581999996,119912.58143099997,321671.57667299995,19.7,17.63,39640.662786398381,3396.7489999999998,4883.3950000000004,null,24100,911,892,939,959,1040,1037,null,0,0]
[1285,"Eslöv",7855442,null,34699,34750,34836,34917,34995,35069,20.54,20.54,null,19.7,17.63,null,1140,1314,2077.5717943126201,1961.4177410652837,34701,34775,2121,3158,449,4101,1322,4701,1486,306,2083,3148,441,4093,1388,4659,1570,308,31744,31920,32179,32438,32878,33236,33236,33557,33793,34123,34593,34701,4228,4294,4412,4488,4579,4550,2106,2155,2119,2169,2124,2121,33503,33789,34088,34536,34699,null,138680.00938366549,21513.515409844043,68959.246883145504,123548.30122570597,141266.00611829417,22174.100779999997,125372.01091999999,337826.00149999995,0,144612.6382504323,21829.311812764594,71054.606486240606,126034.36740586966,140420.99042869525,22527.155114999994,125182.24320599997,340648.58920499991,19.7,17.63,36563.616481845223,4979.3590000000004,3815.0520000000001,null,30653,1174,1211,1253,1280,1291,1322,null,0,0]
[1286,"Ystad",7656058.9000000004,null,31631,31944,32023,32097,32169,32237,20.11,20.11,null,19.7,17.63,null,-1830,-1704,349.46303246494102,628.61098344691436,31714,31911,1500,2389,339,3121,1043,6610,1940,407,1480,2397,315,3140,1030,6624,2073,413,28558,28623,28771,28985,29448,29848,29848,30226,30541,30970,31560,31714,3114,3221,3282,3298,3425,3460,1515,1509,1489,1489,1496,1500,30177,30512,30914,31526,31631,null,133461.25627271459,21570.200084473679,68811.848476813902,120757.2191171117,133045.37334663217,22352.634459999997,128056.54783999998,335250.32657999999,0,139216.54944150939,21887.935443672617,70900.519004392758,123182.54201958879,132485.83756074798,22908.232133999994,129116.57787899997,337328.96187599993,19.7,17.63,44518.906303827622,4488.4809999999998,4752.875,null,27611,908,917,912,973,992,1043,null,0,0]
[1287,"Trelleborg",10601985,null,46593,46928,47044,47153,47258,47358,20.399999999999999,20.399999999999999,null,19.7,17.63,null,-52,405,-511.009073545707,-174.27745686562048,46649,46936,2718,3930,591,5015,1665,7266,2350,441,2643,3961,586,5091,1701,7278,2426,454,42605,42837,42973,43359,43913,44595,44595,44902,45440,45877,46231,46649,5316,5350,5414,5496,5533,5606,2592,2629,2685,2724,2758,2718,44820,45386,45855,46243,46593,null,135877.44875349078,21140.880044048696,68489.535642446455,121624.02866638567,136778.85468100541,22699.90424,129959.45559999999,333988.61599999998,0,141581.06420172087,21448.6665666152,70580.225452676736,124206.49857307837,136896.90075539699,23371.339355999993,132256.56944699996,336179.50067699992,19.7,17.63,54389.16329897938,4991.7809999999999,6373.5209999999997,null,40892,1415,1471,1540,1576,1628,1665,null,0,0]
[1290,"Kristianstad",19368920.899999999,null,86751,86616,86830,87032,87227,87411,21.46,21.46,null,19.7,17.63,null,1849,1739,1308.08764741205,1465.5608893837743,86738,86560,4969,7203,996,9459,3133,13751,4467,1016,4706,7172,1064,9347,3228,13677,4650,1028,80507,81009,81826,82510,83191,84151,84151,84908,85747,86217,86641,86738,9884,10106,10257,10429,10511,10455,4836,4881,4979,4952,4927,4969,84818,85640,86235,86707,86751,null,135705.45929907419,20920.71127508095,68809.613633647066,123566.41779226752,142191.71002705817,21889.970959999999,127508.97197999999,332921.7684,0,141240.24224197809,21221.052794372597,70899.008258081114,126031.38778757269,140677.51215632953,22375.554992999994,126184.25771099997,333980.2605509999,19.7,17.63,104682.85374874251,20054.182000000001,9935.8215,null,77131,2932,2967,2977,2970,3050,3133,null,0,0]
[1291,"Simrishamn",4312704.5,null,19104,18999,19046,19090,19133,19173,20.51,20.51,null,19.7,17.63,null,434,658,30.824334614431798,191.70623430769956,19074,18962,758,1192,158,1592,516,4976,1502,302,707,1179,185,1536,552,4975,1573,299,18997,18951,18905,19065,19485,19376,19376,19278,19174,19227,19267,19074,1776,1757,1751,1770,1759,1750,788,801,790,795,792,758,19317,19218,19228,19298,19104,null,130640.37802966793,20244.4350796611,70858.180456310089,124601.43061859703,144781.71074734934,22434.28096,131322.40784,343217.93635999999,0,135746.90651499439,20529.343540666909,72990.389047061544,126758.90484555696,142751.83599421752,22823.086859999996,131930.52534899997,346792.54757399991,19.7,17.63,44106.656046773285,8255.2340000000004,4729.0320000000002,null,19348,582,584,569,539,526,516,null,0,0]
[1292,"Ängelholm",10827939.199999999,null,44196,44770,44880,44984,45085,45180,20.29,20.29,null,19.7,17.63,null,-251,11,-120.28605023219301,-2.2381087173143897,44268,44866,2429,3649,543,4713,1519,7602,2457,585,2411,3643,539,4729,1620,7679,2629,577,39742,39866,40229,40732,41336,41786,41786,42131,42476,42910,43633,44268,4783,4894,4932,5065,5105,5256,2346,2396,2447,2442,2510,2429,42094,42458,42868,43543,44196,null,134588.44847900496,21826.881016671039,69002.954284806736,121848.05614401675,137660.64055333004,21453.43434,128164.32121999998,333250.53164,60,140353.1607852155,22147.119239036292,71093.236047622675,124330.67695371626,137411.48089831835,21815.880569999994,128150.90586899997,339330.9141719999,19.7,17.63,53109.045935249793,6510.2560000000003,5740.0039999999999,null,38766,1286,1306,1378,1446,1519,1519,null,0,0]
[1293,"Hässleholm",11214082.9,null,52366,52245,52374,52496,52613,52724,21.2,21.2,null,19.7,17.63,null,1465,1876,1107.8209177610599,1139.2898630081936,52369,52241,2869,4241,607,5489,1772,8633,2957,705,2825,4193,562,5499,1832,8494,3161,694,50163,50227,50565,51048,51667,52003,52003,52121,52145,52010,52309,52369,5864,5940,5936,5977,6072,6096,2877,2817,2861,2854,2871,2869,52139,52171,52086,52290,52366,null,133963.986769696,20214.888236588158,69189.631661733103,123274.99430185258,146544.3165219292,22499.598159999998,125663.76108,333877.57675999997,0,139781.62498110978,20513.823358927319,71294.726108410934,125775.16318301026,145354.4698649318,22691.215520999995,126020.19730499997,332859.87334799994,19.7,17.63,61767.494473829887,18545.359,4035.4940000000001,null,49722,1819,1826,1821,1789,1784,1772,null,0,0]
[1315,"Hylte",2128307.7000000002,null,10479,10333,10358,10382,10405,10427,21.45,22.45,null,19.28,17.21,null,5762,5289,-672.22150025983603,-1083.6588760422255,10464,10299,613,923,137,1211,422,1751,555,140,576,912,120,1168,443,1728,583,127,10032,10001,10278,10514,10954,10990,10990,10914,10815,10649,10619,10464,1436,1434,1417,1405,1390,1348,714,683,671,642,641,613,10929,10821,10676,10636,10479,null,135707.60875418154,18709.623103608617,72032.437776936407,130315.02883993307,165311.37379960745,21453.43434,131962.51639999999,337017.15683999995,0,141302.98805699986,18979.716778634694,74204.331556712859,132792.57604966441,159254.1399343879,22055.741036999996,132882.69871799997,351485.92121399991,19.28,17.21,13064.384858229088,4670.085,295.12900000000002,null,10284,410,434,434,410,395,422,null,0,0]
[1380,"Halmstad",24533366.600000001,null,105173,105838,106099,106346,106584,106809,20.98,20.98,null,19.28,17.21,null,-1494,-1137,165.64813945375499,80.75389044896383,105148,105796,5993,8899,1289,11260,3618,15485,5152,1111,5827,8832,1259,11389,3703,15581,5497,1131,93231,94084,95532,96952,98538,99752,99752,101268,102767,103754,104573,105148,11453,11814,12087,12303,12404,12549,5830,5911,5981,6012,6034,5993,101175,102636,103672,104484,105173,null,135375.0809819726,21239.319455738929,68031.68748136115,121523.13925187559,135825.48200351556,22376.5841,125795.48409999999,328985.31847999996,0,141051.41059965082,21547.948971396327,70104.589593090364,124097.00758165111,135610.29880052109,22632.029171999995,126489.53466899997,334850.40371699992,19.28,17.21,121044.68778957233,13755.895,12934.058999999999,null,89659,3075,3117,3218,3377,3538,3618,null,0,0]
[1381,"Laholm",5816703.5,null,26594,26618,26684,26746,26806,26863,20.58,21.4,null,19.28,17.21,null,-924,-567,-354.08334359308401,-379.19008472624409,26575,26565,1531,2168,359,2691,896,5149,1461,306,1482,2177,313,2747,909,5143,1600,300,23458,23517,23781,24195,24664,25147,25147,25491,25903,25967,26319,26575,2874,2932,2988,2969,2987,3050,1451,1473,1504,1495,1536,1531,25426,25849,25962,26249,26594,null,134395.81542765329,20032.080402539203,70947.442428076189,126019.28151445018,142751.18067742157,20497.625979999997,123276.41742,336234.43906,0,140056.7733902937,20324.37490713361,73116.110104959167,128477.25936169636,143303.81758278777,21053.726531999993,122513.66571599997,339667.34183999989,19.28,17.21,52792.425355672407,8687.8349999999991,3903.877,null,23166,841,910,898,915,878,896,null,0,0]
[1382,"Falkenberg",10493807.1,null,46961,47158,47274,47384,47490,47590,21.1,21.1,null,19.28,17.21,null,-253,173,565.76962040121498,717.66227453172451,47017,47108,2653,3944,593,4974,1527,8389,2671,616,2658,3890,516,5095,1527,8376,2759,635,41423,41912,42433,42949,43867,44195,44195,44701,45367,46051,46773,47017,5025,5120,5204,5334,5509,5567,2501,2602,2625,2644,2698,2653,44625,45275,46002,46755,46961,null,133437.66534781235,20106.326859072462,70409.698198868864,125080.12726500708,143374.87982151753,20602.1335,124293.18849999999,336627.43088,0,139338.44303105358,20406.174262025863,72563.739907898271,127768.26128008727,142793.22878800018,20966.504543999996,124335.98225099996,335395.54114199994,19.28,17.21,73662.551393363086,9726.1180000000004,6859.732,null,40168,1483,1477,1518,1501,1503,1527,null,0,0]
[1383,"Varberg",16526081.6,null,67713,68319,68487,68646,68800,68945,20.329999999999998,20.329999999999998,null,19.28,17.21,null,-2315,-1914,-855.68730400258903,-1001.1640312200452,67800,68325,3797,5666,788,7225,2266,12231,3516,804,3797,5606,788,7302,2292,12358,3754,826,59186,59936,60422,61030,61868,62755,62755,63630,64601,65397,66658,67800,7365,7524,7715,7853,7929,8013,3595,3649,3629,3665,3729,3797,63481,64464,65279,66533,67713,null,133548.7946370201,21648.254709805697,69476.711384098482,122202.41377793084,139175.80636640356,20777.401319999997,122094.1761,332062.84722,0,139382.64351242234,21968.831804960595,71593.048824367623,124766.82453901767,140303.28486329177,20878.244198999993,122191.77504599997,333378.01349099993,19.28,17.21,88485.40589226436,8758.4619999999995,9315.2080000000005,null,56069,1951,2019,2144,2169,2223,2266,null,0,0]
[1384,"Kungsbacka",25370254.100000001,null,85738,85723,85934,86134,86327,86510,21.33,21.33,null,19.28,17.21,null,15,193,-192.95704845782001,-140.22019942654242,85801,85653,4926,8263,1141,10962,3761,12483,4240,774,4827,8016,1046,10833,3795,12425,4574,780,76786,77390,78219,79144,80442,81986,81986,83348,84395,84930,85301,85801,11958,12104,12137,12178,12143,12103,5043,5020,5083,5002,4963,4926,83217,84157,84849,85246,85738,null,138674.44912447451,23945.878538256482,69933.087442612086,123135.47254128107,130161.74336988137,19688.781319999998,119875.56853999999,326690.50751999998,0,144614.23871652197,24296.202959368005,72051.85784431707,125565.26995105775,130242.78981604446,19955.144825999996,120760.91909999997,327338.92917899991,19.28,17.21,105592.67357229447,7150.1059999999998,12652.566000000001,null,71852,3123,3319,3475,3573,3638,3761,null,0,138]
[1401,"Härryda",11209368.699999999,null,39715,39878,39976,40069,40159,40244,20.5,20.5,null,19.41,17.34,null,1242,1401,-719.30635875967698,-904.6602188087536,39762,39875,2419,4309,611,5642,1690,4841,1444,303,2365,4103,488,5629,1778,4905,1547,319,35223,35732,36291,36651,37108,37412,37412,37802,37977,38246,39006,39762,5794,5986,6090,6175,6199,6253,2698,2610,2496,2410,2447,2419,37747,37969,38170,38818,39715,null,141044.54820911089,24533.460037038301,69582.46057317048,123026.68450710518,133199.99947582348,20420.33396,120685.50181999999,319735.31433999998,0,147010.39097833197,24889.368868920916,71691.086744144763,125521.41018605451,132479.01390580164,20823.211277999995,120814.91366399998,323677.68239699991,19.41,17.34,44640.224879059046,3101.8719999999998,5266.1059999999998,null,32840,1363,1364,1435,1543,1614,1690,null,0,0]
[1402,"Partille",11020999.1,null,39772,40650,40750,40845,40936,41023,19.96,19.96,null,19.41,17.34,null,1156,780,-689.56635810395005,-642.58996666734765,39852,40730,2568,4056,591,5121,1486,4933,1522,367,2655,3966,531,5176,1526,5032,1575,368,35837,36147,36528,36977,37316,37880,37880,38443,39289,39512,39529,39852,5225,5400,5523,5585,5649,5712,2619,2546,2508,2550,2565,2568,38386,39220,39498,39575,39772,null,143103.91870757777,24644.465845628194,68873.833278080521,122590.84313073341,128083.79925736348,21581.891499999998,123875.15841999999,331148.40641999996,0,149440.6068371064,25010.475710986535,70958.383727809109,125110.31449423102,126815.41549903176,21847.031279999996,124133.50263599998,335505.6069839999,19.41,17.34,28092.376498524554,1950.2190000000001,3911.5659999999998,null,33640,1349,1404,1423,1477,1459,1486,null,0,0]
[1407,"Öckerö",3488678.2,null,12825,12811,12843,12873,12902,12929,21.56,21.56,null,19.41,17.34,null,-1406,-1431,489.74809405536098,261.85988789884686,12800,12819,569,1002,131,1376,523,2564,759,148,547,970,135,1354,518,2568,814,153,12539,12574,12645,12682,12773,12923,12923,12945,12916,12934,12902,12800,1656,1626,1614,1582,1555,1507,654,660,627,622,595,569,12956,12905,12948,12934,12825,null,132200.5758826948,22731.460424642533,70516.528463145369,123252.67363639348,138317.23180453578,20246.154759999998,123407.05181999999,334910.67713999999,0,137657.12557909469,23057.862947452813,72648.067636708089,125601.01311797084,139462.45298621239,20585.427524999996,123147.06348599997,334506.70754999993,19.41,17.34,17786.021482235894,1297.9680000000001,2367.1484999999998,null,12257,479,490,506,508,509,523,null,0,129]
[1415,"Stenungsund",7593857.5,null,27842,27844,27913,27978,28041,28100,21.64,21.64,null,19.41,17.34,null,-9,467,-143.937427478655,80.714195758690039,27870,27862,1620,2502,357,3289,1167,4009,1383,252,1610,2435,310,3282,1169,3992,1468,276,24868,24932,25275,25508,25815,26224,26224,26503,26777,27044,27556,27870,3544,3588,3612,3626,3601,3646,1594,1578,1587,1555,1596,1620,26502,26749,26977,27439,27842,null,136205.56868640659,22791.22380444024,69535.653478822205,122545.62808777238,139077.87254777813,21389.205759999997,121967.89618,327508.06114000001,0,142152.98650638334,23128.105737087746,71644.898826951787,124977.60272845021,137270.81455132196,21428.573408999993,124227.99312299996,330375.08504699991,19.41,17.34,34554.870704222471,2948.152,3835.8290000000002,null,23353,916,962,993,1059,1121,1167,null,0,0]
[1419,"Tjörn",4422894.5999999996,null,16268,16163,16203,16241,16277,16311,21.71,21.71,null,19.41,17.34,null,-1723,-1293,11.432241984436599,122.64667836742319,16275,16146,842,1255,197,1626,525,3569,976,202,787,1239,192,1597,565,3548,1037,198,14974,15050,15135,15315,15584,15790,15790,15922,16016,16147,16312,16275,1703,1739,1745,1785,1833,1823,842,892,885,894,892,842,15891,16023,16145,16303,16268,null,135628.6288507391,21997.863312683607,70643.247213672206,123879.73230980248,145043.28073131596,19834.6564,121348.47139999999,328507.4143,0,141063.92502915813,22311.220059758794,72782.36828334372,126164.73299593384,145578.50527553025,19962.413324999994,120372.57358199997,337775.45538599993,19.41,17.34,37321.927091007368,3377.7420000000002,4489.4120000000003,null,14919,483,482,486,496,506,525,null,0,0]
[1421,"Orust",3675105.2,null,15405,15376,15414,15450,15485,15518,22.51,22.46,null,19.41,17.34,null,-1770,-873,-338.93303095606399,-659.71168693979871,15415,15333,690,1056,137,1417,474,3578,1048,188,671,1072,145,1402,470,3547,1127,195,15083,15036,15054,15010,15093,15108,15108,15110,15218,15315,15345,15415,1475,1497,1548,1562,1572,1554,702,673,675,670,661,690,15059,15187,15255,15354,15405,null,131247.20062856551,21045.057991305101,73118.066136590191,128121.62174169197,146708.05355737708,21955.28816,125165.17311999999,330143.61015999998,0,136900.26495377574,21355.828162422204,75340.13205627464,130782.7209874211,146726.98275207431,22329.867284999993,127522.69988399997,327821.7651839999,19.41,17.34,47025.36976527542,6741.7879999999996,4762.1099999999997,null,15341,489,484,455,445,432,474,null,0,0]
[1427,"Sotenäs",2336878.2999999998,null,9157,9082,9104,9125,9145,9164,21.99,21.99,null,19.41,17.34,null,-4400,-4336,-1903.78413482832,-1457.0416818985786,9160,9052,340,506,57,694,208,2489,614,148,310,509,79,673,217,2434,659,148,9004,8928,8931,9006,9065,9073,9073,9030,9061,9100,9125,9160,743,741,751,746,749,751,335,354,353,366,334,340,9048,9044,9133,9130,9157,null,128786.53169520281,19852.275149602163,69929.007154688443,121719.22291266845,150358.57869831752,21628.702159999997,128333.05731999999,343442.19207999995,0,133557.11471625272,20125.955411629046,72052.775132623326,124169.95848166055,149634.65533540337,21761.886005999993,132486.04634399997,336853.39436999994,19.41,17.34,30340.623145921534,2936.75,3440.1019999999999,null,9285,274,247,224,219,217,208,null,0,0]
[1430,"Munkedal",2230828.2999999998,null,10591,10523,10549,10574,10598,10620,23.38,23.38,null,19.41,17.34,null,2438,3158,294.68588396556601,312.96247758910158,10578,10502,571,861,117,1110,372,1931,611,146,532,900,140,1124,375,1879,663,143,10173,10205,10243,10205,10361,10423,10423,10503,10513,10582,10588,10578,1159,1230,1224,1237,1217,1227,618,602,619,606,593,571,10475,10541,10560,10563,10591,null,133603.71865775753,19861.807885637485,72380.733178757626,127489.0176524023,155142.15191563021,22061.97292,130812.93367999999,341587.18359999999,0,138953.77212428453,20145.987183318553,74610.120738235753,130139.27544128183,156252.05221685686,22113.889028999994,130763.41208099997,336802.51487699989,19.41,17.34,17144.068553815447,4320.3850000000002,904.346,null,10267,370,344,335,353,372,372,null,0,0]
[1435,"Tanum",2892854.4,null,13001,12870,12902,12932,12961,12988,21.56,21.56,null,19.41,17.34,null,365,1439,-1.03835970758519,-525.84155260906118,13013,12865,605,986,144,1248,397,2929,780,176,585,958,135,1264,372,2935,810,190,12270,12303,12346,12455,12606,12763,12763,12873,12841,12912,12965,13013,1316,1333,1335,1348,1372,1392,666,699,685,654,636,605,12851,12845,12904,12988,13001,null,131900.07813200573,20044.147905834081,74179.319992607401,130203.85556016954,157407.91262144834,23193.049099999997,133062.0226,352346.01505999995,0,137562.01606310662,20338.390220683606,76455.31875367352,133056.65915324539,160834.41273919182,23523.977834999994,134613.63983699997,364978.3320719999,19.41,17.34,42637.34553855221,4921.0479999999998,4144.1395000000002,null,12270,376,382,367,391,385,397,null,0,0]
[1438,"Dals-Ed",941040,null,4673,4617,4628,4639,4649,4659,23.21,23.21,null,19.41,17.34,null,4911,5940,4677.4898041817296,5554.9952223894115,4650,4606,205,365,47,466,153,944,334,59,197,351,48,463,152,931,359,56,4665,4740,4764,4799,4777,4763,4763,4806,4813,4761,4756,4650,518,529,536,529,527,513,246,245,224,233,222,205,4807,4824,4780,4775,4673,null,131205.43523248666,19727.871167153633,72532.986797756748,126919.3460923488,162433.59844465967,24262.073939999998,129297.57463999999,340714.11035999999,0,136752.77001891405,20014.543980519284,74744.227314150921,129542.69788004986,164526.45151973228,24835.422725999993,131713.50873599996,335612.5577549999,19.41,17.34,7890.4801977663155,1652.8679999999999,127.056,null,4840,142,154,159,161,164,153,null,0,0]
[1439,"Färgelanda",1338469.8,null,6536,6442,6458,6473,6487,6501,22.91,22.91,null,19.41,17.34,null,2957,3279,-2123.5874540108898,-2187.8567101040899,6512,6434,311,515,78,672,219,1293,357,85,302,506,68,662,226,1284,366,89,6549,6520,6502,6495,6627,6592,6592,6602,6637,6658,6576,6512,725,731,748,771,743,750,347,349,352,342,359,311,6596,6636,6672,6593,6536,null,132584.42049916458,19036.54298751149,71283.691136817855,125354.11843201217,164727.00554371564,23931.133459999997,142174.86061999999,357307.94501999998,0,138331.01893512628,19317.68963058163,73443.675091510551,127939.24082243659,166824.93280228609,24089.882399999995,137883.42602999997,368860.74889499991,19.41,17.34,8181.5720850918296,3896.1030000000001,187.43899999999999,null,6785,238,227,231,221,218,219,null,0,0]
[1440,"Ale",7971904.7999999998,null,32378,32454,32534,32610,32683,32752,21.87,21.87,null,19.41,17.34,null,942,1284,196.211441533075,285.19161959322537,32394,32446,2199,3260,464,4077,1258,4142,1309,183,2097,3273,460,4171,1266,4067,1411,192,27842,28074,28423,28862,29549,30223,30223,30926,31402,31868,32148,32394,4096,4155,4303,4424,4500,4541,1990,2081,2182,2158,2179,2199,30797,31274,31760,32117,32378,null,139289.86334582788,21951.501009710992,69278.758174595816,123726.03597258184,144767.15550083571,21422.952979999998,122994.46483999999,337571.26441999996,0,145019.64959544552,22268.027433598378,71402.870627844328,126344.93167216434,145157.67273513816,21742.157222999995,123748.27218899997,342239.35212899989,19.41,17.34,30434.637393642144,2561.1880000000001,3680.1979999999999,null,27028,1075,1112,1100,1188,1194,1258,null,0,0]
[1441,"Lerum",11885624.6,null,43481,43727,43835,43937,44035,44128,20.65,20.65,null,19.41,17.34,null,2775,2795,-1206.57550068259,-1235.1485538490797,43536,43706,2973,4665,633,6077,1926,5507,1913,350,2841,4661,649,6063,1934,5454,2087,368,39070,39319,39771,40181,40692,41510,41510,42137,42568,43020,43399,43536,6344,6459,6553,6654,6698,6710,2888,2926,2971,2963,2960,2973,42051,42508,42920,43365,43481,null,140022.56183983618,23995.935820925777,69271.218065638604,122246.726285414,133120.94698339308,20142.735859999997,118579.02211999999,325975.28417999996,0,145775.36747723832,24341.626141275203,71378.233414333678,124717.75567866756,134467.89250741131,20334.145130999994,118376.85142799997,320465.00583899993,19.41,17.34,49953.21678002242,3564.8670000000002,6101.2160000000003,null,37647,1552,1625,1686,1765,1863,1926,null,0,0]
[1442,"Vårgårda",2747051.5,null,12270,12358,12388,12417,12445,12471,21.61,21.61,null,19.41,17.34,null,1414,1513,-539.17577689903101,-558.7034340420314,12268,12384,777,1128,188,1416,456,1930,538,113,740,1155,178,1465,471,1942,561,112,11030,11065,11089,11165,11295,11490,11490,11658,11810,11946,12180,12268,1429,1435,1461,1527,1584,1604,737,774,814,785,812,777,11610,11797,11906,12176,12270,null,136269.77005219657,20968.372019350634,71118.280731000195,126087.50774822458,152040.51088815273,20973.352919999998,133561.69918,344519.92588,0,141797.18745979463,21269.031574398257,73298.580119549224,128722.153931024,151509.92427975131,21435.841907999995,130208.92944299997,357376.52047499991,19.41,17.34,15661.653730361124,2642.2370000000001,1376.3140000000001,null,10947,374,406,383,401,412,456,null,0,0]
[1443,"Bollebygd",2423253.2999999998,null,9674,9742,9766,9789,9811,9832,21.59,21.59,null,19.41,17.34,null,-257,-521,-473.39288808802701,-549.1817618290961,9703,9733,568,933,121,1214,369,1567,447,77,570,897,106,1192,368,1541,493,71,8507,8562,8652,8799,9102,9262,9262,9427,9495,9544,9634,9703,1255,1304,1307,1334,1341,1335,606,602,570,576,570,568,9403,9481,9503,9603,9674,null,137046.33307191831,22025.455758075797,70155.045263679422,123509.811215225,145601.39193649145,20091.57072,123150.1375,323323.40586,0,143074.12385192307,22351.609979421901,72270.519329355768,125720.33822851886,149720.28527871266,20422.405475999996,119497.23863099997,337634.2388339999,19.41,17.34,12076.273103326788,1124.0319999999999,1284.3399999999999,null,8192,297,330,353,348,372,369,null,0,0]
[1444,"Grästorp",1312102.8999999999,null,5673,5551,5565,5578,5590,5602,21.99,21.99,null,19.41,17.34,null,-904,-411,2268.4183022724701,1929.5669204339511,5646,5563,272,413,70,548,182,1115,319,82,264,404,62,540,193,1098,331,85,5639,5641,5630,5644,5721,5750,5750,5731,5693,5685,5730,5646,634,642,628,631,623,618,291,287,279,267,295,272,5705,5681,5708,5711,5673,null,134277.16415327651,20814.10974904805,70725.251696548541,123391.20058944849,153624.11474741111,21770.222759999997,130879.33949999999,331400.96625999996,0,140114.83486363315,21121.969765993399,72870.339710330343,125517.46620697905,150083.25904996909,22111.812314999996,135460.93914899995,320555.34289799992,19.41,17.34,7450.6449100738664,1868.039,350.53500000000003,null,5839,209,189,199,173,187,182,null,0,0]
[1445,"Essunga",1206185.7,null,5715,5669,5683,5696,5709,5721,21.57,21.57,null,19.41,17.34,null,1749,2560,1686.1593785805701,3017.1017844558583,5717,5656,302,512,74,644,160,1136,305,80,300,499,73,638,171,1124,324,77,5502,5494,5538,5590,5620,5647,5647,5671,5654,5687,5698,5717,649,655,646,682,706,718,332,349,338,320,314,302,5671,5651,5681,5710,5715,null,133835.74628738596,19069.198658976497,71063.825701213282,124669.27517038491,155165.25104003015,22163.21458,129574.08411999998,343606.57369999995,0,139814.46003780593,19354.605784907199,73228.076527286801,127217.16029880625,154369.0706014256,22255.105580999996,131426.92220399997,335925.10321199993,19.41,17.34,7340.5452494994743,2564.7069999999999,175.024,null,5651,189,171,183,178,179,160,null,0,0]
[1446,"Karlsborg",1587434.5,null,7045,7087,7104,7121,7137,7152,21.32,21.32,null,19.41,17.34,null,-861,-145,-1934.8998674490499,-2075.0701383513169,7057,7061,337,485,64,639,226,1567,475,87,321,499,77,644,218,1507,534,89,6699,6757,6786,6764,6913,6954,6954,6941,6940,6962,6965,7057,714,706,710,718,690,703,318,343,331,324,331,337,6968,6967,6989,6957,7045,null,132240.49312553791,20995.141977166553,71933.822331726406,125973.74484959152,151652.88971299282,21282.520999999997,128629.16196,343334.41869999998,0,137648.3944858998,21297.879217708181,74139.551574270969,128679.48951811348,156755.30256014908,21441.033692999994,126452.15381699997,343026.42673499993,19.41,17.34,11460.120047038377,4018.319,444.28500000000003,null,6865,184,197,187,206,221,226,null,0,0]
[1447,"Gullspång",1023300,null,5203,5139,5152,5164,5176,5187,22.49,22.49,null,19.41,17.34,null,3120,2989,478.70519037588798,920.19191009385486,5194,5119,238,350,53,452,163,1276,351,73,241,346,42,450,155,1280,372,68,5221,5185,5240,5229,5307,5280,5280,5293,5280,5169,5206,5194,506,502,499,477,493,505,230,229,232,230,242,238,5258,5284,5204,5179,5203,null,134213.77908128704,17792.672701208434,71979.196083926508,128122.97075210277,162327.29869289752,23343.27866,138055.52253999998,351944.31427999999,0,140523.45791861805,18067.685384509423,74164.888639836674,130642.46829378563,160623.62121815572,23189.626880999993,133568.01433799998,349969.91999399994,19.41,17.34,6426.0323560491306,2963.319,82.525000000000006,null,5427,193,170,179,181,168,163,null,0,0]
[1452,"Tranemo",2724164.4,null,11981,11897,11926,11954,11981,12006,21.5,21.5,null,19.41,17.34,null,857,1154,626.69213241721104,-140.99002977301279,11940,11883,650,989,134,1286,421,2186,639,164,631,970,124,1283,420,2201,685,162,11573,11531,11640,11619,11776,11841,11841,11874,11936,11885,11937,11940,1358,1399,1424,1415,1420,1420,682,640,643,632,628,650,11876,11910,11868,11896,11981,null,133210.3855234253,19293.990937885133,72346.678172484651,129029.98093250304,148632.4323071198,21034.315639999997,125704.04001999999,341410.82715999999,0,138886.00136448105,19576.600068473417,74547.290810214981,131562.44761066657,150714.72715465009,21338.236349999996,123542.67750299997,340991.24701499991,19.41,17.34,15145.162782094285,5741.7070000000003,439.096,null,11758,444,429,408,412,391,421,null,0,0]
[1460,"Bengtsfors",1871987,null,9254,9167,9190,9211,9232,9252,22.92,22.92,null,19.41,17.34,null,4633,4390,117.739860120183,-300.30605320669656,9255,9138,399,655,90,859,296,2028,625,164,371,638,81,869,272,2049,626,164,9588,9550,9556,9626,9940,9905,9905,9846,9750,9591,9409,9255,1036,1070,1057,1005,958,949,474,451,451,438,406,399,9867,9782,9605,9443,9254,null,132327.16898639442,18664.91097681411,72309.285890855739,128718.00854751817,157807.21155938643,23835.334899999998,135512.50621999998,363820.06985999999,0,137579.57013544685,18929.044475577219,74526.864778438947,131289.56698737497,156146.83515740695,23974.624772999996,134749.66460399996,355833.52197299991,19.41,17.34,13062.000059148511,4276.5569999999998,180.53100000000001,null,9993,292,270,278,302,307,296,null,0,0]
[1461,"Mellerud",1817622.1,null,9274,9193,9216,9237,9258,9278,22.6,22.6,null,19.41,17.34,null,3703,4343,2898.64200275238,2733.6787350600907,9263,9165,480,702,93,947,260,1900,560,143,439,733,121,944,263,1893,581,139,8946,8892,8936,9169,9323,9377,9377,9354,9310,9312,9268,9263,1019,1004,977,1011,1039,1040,488,534,517,496,474,480,9349,9292,9294,9268,9274,null,135928.42940365017,18705.116403841697,70862.813295150947,126734.51915965753,164524.31020048141,23177.808419999998,134932.27176,345544.3173,0,141205.85488265633,18968.865808321021,73040.371457992282,129255.07754811856,161134.1746747354,24224.868809999993,135251.19103499997,343728.3560669999,19.41,17.34,14204.252136783129,4775.6589999999997,366.101,null,9567,276,307,320,309,301,260,null,0,0]
[1462,"Lilla Edet",3309611,null,14460,14414,14450,14484,14516,14547,22.37,22.37,null,19.41,17.34,null,-166,406,-112.28441633461399,-218.88489163333361,14428,14426,937,1283,210,1565,450,2256,581,118,915,1316,208,1616,450,2238,609,121,12580,12829,13031,13178,13728,13961,13961,14046,14109,14282,14509,14428,1560,1616,1655,1696,1738,1775,921,928,933,924,976,937,13993,14077,14237,14495,14460,null,136709.34929329818,19870.603949161163,70532.483594863705,125493.56632569838,154387.57407574487,22657.448059999999,130747.61648,338253.82915999996,0,142535.98181741385,20162.553842746325,72704.200328099541,128354.01940319348,154126.30088258552,22950.804770999996,129302.44378199997,339722.37476099993,19.41,17.34,22551.155584202395,3394.9340000000002,1818.662,null,12831,438,431,443,447,444,450,null,0,0]
[1463,"Mark",7972555.2000000002,null,35345,35279,35366,35448,35527,35602,21.51,21.51,null,19.41,17.34,null,799,1115,781.97707503211996,652.24151979197268,35329,35287,1953,2978,434,3939,1279,6019,1795,412,1924,2906,400,3902,1332,5989,1878,428,33763,33753,33887,33906,34218,34484,34484,34781,34754,34896,35201,35329,4260,4320,4308,4316,4350,4373,1879,1918,1914,1947,1957,1953,34727,34790,34920,35141,35345,null,135091.04074959527,20405.512277740138,70544.678947506342,124624.12647164559,143737.69666665961,21584.068739999999,129907.20183999999,341844.09791999997,0,140940.60797425543,20706.415422192509,72681.481210497863,127149.16601886626,144240.43841547231,21859.491563999996,130488.24747599997,339479.39922299993,19.41,17.34,51072.707739011195,7068.509,4015.9090000000001,null,33660,1242,1219,1218,1248,1260,1279,null,0,0]
[1465,"Svenljunga",2294902.5,null,10852,10760,10787,10812,10836,10859,22.05,22.05,null,19.41,17.34,null,1923,2416,-260.14541156046698,-637.84266100970217,10816,10759,613,895,112,1168,343,2076,591,107,590,895,136,1158,357,2064,625,111,10239,10299,10365,10506,10679,10659,10659,10683,10780,10751,10864,10816,1183,1189,1210,1257,1294,1280,573,596,612,619,623,613,10655,10772,10745,10829,10852,null,136283.03527417785,18165.169148789042,73014.333407451733,129707.24362134169,154020.62662316638,22373.318239999997,127792.01317999999,344683.21888,0,142020.59741167317,18430.233640803912,75243.89646618694,132490.01289884301,154030.63634789197,22504.311260999995,128546.51988599997,347605.58110499993,19.41,17.34,16855.176853659883,5049.835,480.19,null,10425,393,392,372,336,312,343,null,0,0]
[1466,"Herrljunga",2115893,null,9490,9470,9493,9515,9536,9556,21.94,21.94,null,19.41,17.34,null,-161,91,-637.83459430713197,-988.87547058657219,9517,9441,478,808,119,1014,290,1769,526,104,469,781,97,988,321,1748,543,94,9282,9274,9376,9349,9486,9485,9485,9494,9464,9444,9501,9517,1064,1063,1077,1096,1103,1133,548,535,513,480,480,478,9482,9494,9453,9510,9490,null,133585.49807250532,19903.850019497637,71932.150079701125,126845.49219071986,154860.32042004171,22020.605359999998,130392.72635999999,335829.47241999995,0,139419.02375919404,20198.01986490409,74096.283898695998,129468.24529681943,155023.42684043926,22418.127629999995,131420.69206199996,353079.7992089999,19.41,17.34,13660.051465556558,2903.2809999999999,504.39,null,9270,324,311,306,301,284,290,null,0,0]
[1470,"Vara",3504554.4,null,16131,16116,16156,16194,16230,16264,22.37,22.37,null,19.41,17.34,null,1051,832,1157.8112584667999,1842.3771339968671,16163,16066,839,1322,179,1705,555,2885,895,176,804,1298,178,1699,538,2902,913,179,15557,15609,15597,15662,15788,15942,15942,15952,16024,16096,16162,16163,1799,1838,1858,1831,1892,1884,875,873,842,862,844,839,15970,16040,16045,16161,16131,null,134393.90982425891,19378.173899423015,71318.595412329363,125864.20342267033,155931.23686932289,21962.908499999998,133380.98825999998,358678.51759999996,0,140010.95692987621,19659.354245896426,73491.110261576818,128393.11050994505,154752.68059495717,22339.212497999994,131376.04271099996,356918.60503799992,19.41,17.34,19917.75370133447,5237.5339999999997,556.28200000000004,null,16001,515,523,571,585,548,555,null,0,0]
[1471,"Götene",3002501.3,null,13276,13221,13254,13285,13315,13343,22.12,22.12,null,19.41,17.34,null,-1452,-983,-532.52266834994396,-499.5476698631519,13275,13218,654,1084,150,1435,437,2604,747,136,667,1034,130,1407,469,2594,801,125,13092,13028,13080,13160,13275,13242,13242,13232,13207,13194,13263,13275,1547,1538,1544,1560,1580,1585,714,703,694,683,678,654,13271,13198,13189,13231,13276,null,133372.70582679243,20591.880602910434,69952.049033920994,123210.59794585691,150225.67402680765,21015.809099999999,121995.11167999999,341384.70027999999,0,139540.41525878187,20904.286485789689,72061.497295207155,125447.14220995813,147551.12322648126,21530.332394999994,124518.73308299997,348072.84175499994,19.41,17.34,19432.466165628408,6203.0429999999997,960.89,null,13054,457,460,454,459,440,437,null,0,0]
[1472,"Tibro",2371940.4,null,11402,11345,11373,11399,11424,11448,21.71,21.71,null,19.41,17.34,null,1528,1714,-1032.65018302662,-1301.0330094626806,11399,11332,654,908,127,1173,401,1966,716,146,647,923,148,1161,386,1964,727,155,10673,10754,10864,10980,11070,11110,11110,11168,11240,11297,11281,11399,1287,1291,1315,1311,1315,1300,593,633,627,631,644,654,11138,11249,11256,11275,11402,null,134881.20606077288,19932.018992558726,69291.023381020306,122973.05030177698,146120.77927150737,21414.244019999998,125196.74309999999,322884.69199999998,0,140812.01323302853,20229.362404678308,71404.51441680151,125438.84253027976,147376.13323362224,21534.485822999995,127117.74065399996,332360.42363099993,19.41,17.34,15260.659393990958,5129.598,911.54100000000005,null,10603,367,353,354,380,376,401,null,0,0]
[1473,"Töreboda",1879724.8,null,9209,9158,9181,9202,9223,9242,21.72,21.72,null,19.41,17.34,null,958,1355,3975.1479140440201,3722.8547334527802,9186,9141,450,707,115,901,320,1856,502,110,425,700,100,896,319,1852,542,110,9009,8992,9072,9293,9435,9414,9414,9312,9293,9281,9207,9186,1049,1015,1025,1016,998,1016,498,503,476,460,462,450,9338,9292,9256,9209,9209,null,134793.53193288224,18986.808143386828,70232.979611861825,124193.79060998689,158885.99798622259,23063.50332,134454.36757999999,347377.55338,0,140266.75810133663,19258.74779865862,72360.879003473907,126758.33371328277,161206.3692501552,23169.898097999994,135507.66521399998,348556.71611699992,19.41,17.34,11084.522588841361,3548.8780000000002,236.476,null,9405,319,314,290,311,314,320,null,0,0]
[1480,"Göteborg",158301204.59999999,null,595574,604325,605815,607223,608581,609868,21.12,21.12,null,19.41,17.34,null,-2342,-2715,567.521554485872,676.79186392415613,596841,604616,33561,45120,6573,57405,17943,69987,19293,4635,33118,44611,6293,57682,18545,70678,20333,4548,526089,533271,541145,548190,556640,564039,564039,571868,579281,583056,587549,596841,58992,60843,62026,62771,63244,63978,34286,34287,34427,34067,33446,33561,571153,578913,583151,586614,595574,null,139842.09035009649,21835.647887585274,67888.79541881186,122233.51865872282,131853.1109915741,26180.222379999999,135164.14781999998,340178.50931999995,0,145772.7609961181,22154.875570334087,69942.958032141032,124749.13437500468,130647.09365823583,26439.684290999994,135507.66521399998,343114.68707999995,19.41,17.34,300927.24506562843,23591.978999999999,42066.464,null,493247,15930,16295,16558,16980,17419,17943,null,0,0]
[1481,"Mölndal",20361458.300000001,null,70205,70633,70807,70972,71131,71281,20.51,20.51,null,19.41,17.34,null,-2729,-2856,391.419727255986,192.85073213215492,70109,70534,4167,6202,917,8004,2485,8152,2522,558,4109,6071,820,7990,2594,8194,2675,568,61659,61978,62927,63340,64465,66121,66121,68152,69364,69901,69943,70109,8475,8729,8821,8931,8879,8921,4247,4189,4266,4263,4258,4167,67998,69227,69981,70089,70205,null,141215.86468126025,24566.398603397516,68655.508614148654,121963.40302839194,129818.47738087998,22990.565779999997,126791.57139999999,335505.06365999999,0,147245.22704843685,24925.849237727471,70734.104450965504,124514.23784197799,129370.29856554113,23061.908969999993,127563.19580699997,334777.71872699994,19.41,17.34,55287.079978953676,3736.5770000000002,7181.4489999999996,null,59303,2234,2294,2366,2448,2496,2485,null,0,0]
[1482,"Kungälv",13044474,null,48930,49734,49857,49973,50085,50191,21.44,21.44,null,19.41,17.34,null,-58,13,130.34038412818299,61.574619740104936,49068,49785,3063,4239,608,5490,1751,7001,2408,530,3173,4232,596,5537,1761,7021,2578,549,41753,42109,42334,42730,43289,44110,44110,45086,46336,47050,48271,49068,5641,5790,5929,5965,6081,6098,2750,2772,2841,2872,2969,3063,44890,46151,46993,48135,48930,null,137439.60257114843,22719.883002061975,70283.456120947056,123667.6810548902,133847.7560027267,21062.619759999998,122138.80952,327099.82863999996,267,143635.23340778417,23061.896158132196,72416.4578155114,126205.83701116565,133578.21554486727,21354.850061999994,122359.98887999998,329099.98265099991,19.41,17.34,56718.344746496303,3809.7860000000001,6758.4570000000003,null,39557,1432,1454,1529,1619,1687,1751,null,0,0]
[1484,"Lysekil",3370045.3,null,14209,14007,14042,14075,14106,14136,22.46,22.46,null,19.41,17.34,null,1209,1281,2099.0400547158602,1642.5486170637514,14170,13969,628,996,133,1332,445,3281,969,224,557,962,131,1286,448,3267,1035,227,14396,14369,14299,14464,14570,14621,14621,14611,14555,14366,14266,14170,1471,1491,1520,1486,1498,1465,676,685,663,660,640,628,14611,14594,14406,14308,14209,null,132778.71044677566,20368.511207490446,69760.949105115651,123170.34485333896,147531.79020010846,21686.399019999997,125231.57893999999,343891.79213999998,0,137499.34197298845,20643.04205833677,71862.262134158853,125484.8773186406,146381.48524505881,21803.420285999993,125481.29002199997,346216.25943899993,19.41,17.34,33783.806731805133,3892.9140000000002,3434.35,null,14623,473,451,420,411,396,445,null,0,0]
[1485,"Uddevalla",13284638.1,null,57259,57122,57263,57396,57524,57646,22.16,22.16,null,19.41,17.34,null,1774,1637,2342.3749472186901,2423.8742920051745,57282,57045,3351,5016,704,6402,1984,8882,2962,657,3235,4902,697,6328,2026,8908,3030,676,52530,53025,53517,54180,55164,55763,55763,56259,56703,56787,57122,57282,6563,6777,6893,6928,7068,7106,3395,3423,3427,3446,3388,3351,56182,56712,56833,57040,57259,null,136485.07852900139,21301.567288187231,68985.150520258321,123252.87885705018,140773.72986519002,22849.045179999997,129578.43859999999,339414.29807999998,0,142234.94914595148,21611.61606924732,71078.546904672985,125624.60755548044,138835.36679898688,23201.048807999996,130224.50479799997,337924.97879399994,19.41,17.34,66935.866365738577,6953.9129999999996,7225.982,null,50869,1838,1828,1886,1918,1958,1984,null,0,0]
[1486,"Strömstad",2672910.4,null,13340,13478,13511,13542,13572,13601,21.91,21.91,null,19.41,17.34,null,1386,1747,-658.70550027829802,-357.69794306090716,13290,13476,722,1190,171,1460,385,2300,665,148,713,1188,164,1501,399,2265,728,144,12295,12480,12694,12854,13079,13218,13218,13253,13218,13244,13277,13290,1438,1508,1516,1557,1614,1631,854,836,805,782,734,722,13228,13228,13270,13262,13340,null,139272.1253873292,19424.076586407718,71368.191159868831,127461.76247358479,152483.0064369046,23901.740719999998,135570.20307999998,332038.89757999999,0,145186.76421711716,19708.002954757671,73548.985456400667,130125.094412622,151382.07947453315,24669.285605999994,135931.31486999997,347135.20538399991,19.41,17.34,32939.114249373903,2483.5250000000001,3157.04,null,11564,424,414,417,389,394,385,null,783,0]
[1487,"Vänersborg",8897371.0999999996,null,39784,40008,40107,40200,40290,40375,22.21,22.21,null,19.41,17.34,null,1986,1996,1727.52427988558,1632.1067701633174,39904,40012,2314,3319,422,4355,1415,6599,2234,432,2282,3252,467,4252,1471,6578,2349,451,36968,37369,37890,38381,38955,39151,39151,39411,39591,39624,39636,39904,4814,4868,4852,4874,4806,4777,2309,2305,2319,2280,2272,2314,39355,39599,39611,39576,39784,null,137380.71558316311,21217.342879474534,69447.82541208333,123802.48701120143,140861.40825466803,22249.215559999997,129251.85259999998,336121.22258,0,143294.42421984143,21529.447641063303,71543.933509451992,126061.22773563057,140430.17534140058,22462.776980999995,129091.65731099997,336487.8927059999,19.41,17.34,45014.986506065485,6649.1840000000002,3728.4780000000001,null,36909,1385,1372,1386,1392,1410,1415,null,0,0]
[1488,"Trollhättan",13710636.300000001,null,59295,59118,59264,59402,59535,59661,22.36,22.36,null,19.41,17.34,null,129,1,640.24978894087701,655.30786574393005,59274,59073,3318,5099,758,6536,2189,8204,2645,568,3265,4977,700,6457,2225,8215,2760,568,55749,56573,56929,57092,57753,58238,58238,58728,59058,59249,59154,59274,7076,7208,7266,7302,7226,7294,3531,3583,3576,3486,3430,3318,58624,59006,59282,59193,59295,null,137036.28454644972,20554.240603133683,68000.897508603462,122320.55044463585,136636.4872014561,23385.734839999997,128547.51546,333633.72587999998,0,142974.55586351681,20857.512140726943,70059.404807076528,124707.61728992472,135261.15746084784,23636.120390999993,129498.69325499996,337345.57558799989,19.41,17.34,51511.397680734619,4857.5460000000003,5456.4949999999999,null,54280,2035,2043,2129,2141,2207,2189,null,0,0]
[1489,"Alingsås",10245920.1,null,42108,42408,42513,42612,42707,42797,21.36,21.36,null,19.41,17.34,null,514,982,1677.95287593784,1601.3280345924277,42199,42382,2478,3782,551,4845,1577,6998,2190,457,2442,3784,529,4933,1585,6952,2370,442,38355,38619,39188,39602,40045,40390,40390,41070,41420,41602,41853,42199,5025,5187,5238,5293,5336,5396,2414,2457,2487,2484,2479,2478,40934,41371,41633,41779,42108,null,135718.72887213543,22250.353030840412,68931.561084525747,121608.74588561492,132722.3661901172,21602.575279999997,123643.28236,330191.50943999999,0,141540.7616956147,22577.274106130651,71038.197761428601,124204.33354289799,131665.72556493586,21740.080508999996,125961.01095599997,331773.75192599994,19.41,17.34,44519.700229053109,4547.1350000000002,5004.1819999999998,null,36703,1336,1330,1369,1431,1500,1577,null,0,0]
[1490,"Borås",26791708.600000001,null,114492,114747,115030,115297,115555,115799,21.31,21.31,null,19.41,17.34,null,297,205,-103.70450016656901,-160.22212110610326,114445,114592,6512,9970,1402,12749,4007,15754,5244,1167,6309,9800,1331,12735,4100,15698,5470,1198,104867,105995,107022,108488,109880,111026,111026,112178,113179,113714,114091,114445,13050,13403,13689,13996,14093,14151,6911,6855,6807,6716,6598,6512,112121,113022,113700,114030,114492,null,135704.32162768493,20383.284183437077,68285.455956115533,122848.20583555114,139279.05763051714,23333.481079999998,128889.34213999999,333875.39951999998,0,141406.18186586181,20679.640643073406,70359.190411256481,125303.31103064226,137541.51821121023,23630.928605999994,129258.83278799997,334136.01410099992,19.41,17.34,99989.293510795062,9892.7890000000007,11218.268,null,100888,3696,3790,3827,3890,3915,4007,null,0,0]
[1491,"Ulricehamn",5732639.2999999998,null,25081,25135,25197,25256,25312,25366,21.05,21.05,null,19.41,17.34,null,65,636,927.08404342441099,579.10786470187577,25108,25087,1366,2093,344,2645,851,4390,1342,342,1424,2064,267,2661,891,4363,1438,323,23015,23211,23244,23494,23887,24296,24296,24445,24668,24704,24898,25108,2886,2844,2886,2886,2896,2989,1339,1371,1403,1397,1447,1366,24433,24640,24694,24856,25081,null,132762.77975625655,20300.94612174436,71015.04998557888,125360.88730862587,143264.12264826888,21410.978159999999,127473.04751999999,336272.54076,0,139020.68058821114,20613.423805524475,73168.427910190425,128006.51930441792,143813.14922087707,21910.371056999993,127116.70229699997,338335.12980899995,19.41,17.34,34675.130107589037,6856.4170000000004,2127.5839999999998,null,22505,851,855,849,856,846,851,null,0,0]
[1492,"Åmål",2479677.7999999998,null,12222,12046,12076,12104,12131,12157,22.46,22.46,null,19.41,17.34,null,3712,3980,3281.8899729658301,3269.8978476332459,12216,12006,561,942,138,1260,431,2354,830,211,553,892,109,1231,428,2332,877,192,12211,12229,12326,12601,12801,12711,12711,12720,12610,12441,12318,12216,1472,1482,1449,1412,1392,1398,659,631,650,606,607,561,12707,12619,12440,12357,12222,null,132302.45085490137,20006.083827922255,69133.331225029557,122835.82155105735,143892.20648332566,23048.262639999997,126693.59559999999,342181.57011999999,0,138254.29827019395,20305.537404103725,71220.849440659906,125094.22703374542,143290.20855524534,23839.638362999995,128963.93939999997,348446.65027499991,19.41,17.34,14173.273626825048,3779.68,361.18200000000002,null,12610,460,487,463,460,448,431,null,0,0]
[1493,"Mariestad",5585756.9000000004,null,24798,24677,24738,24796,24851,24904,21.26,21.26,null,19.41,17.34,null,-868,-301,765.17642434475897,905.25650360478448,24768,24647,1255,1931,274,2435,796,4632,1614,327,1223,1913,257,2448,788,4574,1682,347,23739,23870,23921,24043,24215,24290,24290,24372,24537,24513,24723,24768,2623,2638,2632,2616,2654,2709,1298,1298,1310,1322,1281,1255,24377,24543,24532,24718,24798,null,133852.83951547771,20670.549120573607,69203.171791246219,121975.5419429608,140981.95981136928,21957.465399999997,121655.46223999999,335551.87432,0,139602.89830895956,20974.602240518121,71314.146478143462,124370.28113751436,142630.81479250934,22114.927385999996,122828.28788699997,333903.42213299993,19.41,17.34,30418.893084729058,7399.7950000000001,2139.5230000000001,null,23867,726,751,819,837,836,796,null,0,0]
[1494,"Lidköping",9748337.1999999993,null,40445,40570,40670,40765,40856,40942,21.26,21.26,null,19.41,17.34,null,-824,-690,836.36929629020904,1100.199452024498,40457,40539,2113,3210,431,4264,1382,6941,2268,478,2074,3216,453,4216,1454,6928,2417,467,38254,38414,38761,39009,39235,39506,39506,39879,40089,40328,40460,40457,4499,4632,4642,4687,4726,4695,2155,2188,2188,2147,2152,2113,39827,40106,40344,40482,40445,null,132950.96682046083,21403.544465785264,69845.290487686128,123212.90287661114,139500.81788538469,21565.562199999997,126648.96217999999,332235.93779999996,0,138662.69171539534,21718.417829112219,71961.597596896856,125752.92964643544,140461.54032310506,21935.291624999994,126243.44405999997,334907.51335199992,19.41,17.34,48632.669117920297,6381.7449999999999,4441.9610000000002,null,37725,1249,1273,1340,1355,1379,1382,null,0,0]
[1495,"Skara",4321627.4000000004,null,18765,18675,18721,18765,18807,18847,21.5,21.9,null,19.41,17.34,null,531,543,519.59973102763001,840.28844541438775,18755,18654,1022,1511,221,1936,707,3133,971,210,972,1493,215,1946,676,3123,1033,211,18281,18580,18747,18711,18979,18843,18843,18829,18837,18695,18732,18755,2121,2175,2178,2158,2143,2157,1098,1088,1068,1029,1012,1022,18849,18835,18725,18798,18765,null,135630.50545650272,19801.939020199716,69129.202141000191,123230.93701772185,143282.75659105164,22646.561859999998,128266.65149999999,343680.59985999996,0,141224.20420789189,20087.682612063301,71240.327770028118,125772.79676420419,143753.05031810686,23007.914405999996,129225.60536399997,349184.92210199992,19.41,17.34,21116.509731721413,4483.7349999999997,1523.847,null,18565,656,652,658,670,704,707,null,0,0]
[1496,"Skövde",14123575.1,null,57404,57771,57913,58048,58178,58301,21.61,21.61,null,19.41,17.34,null,-2926,-2707,913.97588159788302,1715.3750060203065,57463,57763,3347,4724,683,5914,1841,8137,2639,580,3272,4712,692,5964,1865,8198,2781,570,52212,52859,53134,53555,54133,54975,54975,55729,56366,56791,57016,57463,5953,6051,6192,6323,6479,6597,3216,3330,3391,3428,3399,3347,55707,56181,56800,57036,57404,null,133574.07861676914,21265.988026639021,68890.209905450058,122108.71981177868,137244.42417637029,22613.903259999999,129259.47293999999,328309.28545999998,0,139230.94727253259,21576.739867504341,70989.396200385047,124578.35220537733,137418.81983200659,22912.385561999996,130232.81165399998,334803.67765199993,19.41,17.34,58666.742358141841,7003.2730000000001,5383.1390000000001,null,50228,1695,1712,1725,1793,1801,1841,null,0,0]
[1497,"Hjo",2059340.7,null,9254,9271,9294,9316,9337,9357,22,22,null,19.41,17.34,null,-156,416,-856.99788477280299,-803.99106140310232,9243,9258,498,734,88,959,290,1859,577,100,504,730,100,963,268,1848,600,109,8832,8805,8885,8983,9048,9093,9093,9176,9210,9229,9233,9243,1000,1026,1035,1035,1057,1047,502,490,488,489,479,498,9160,9208,9245,9253,9254,null,135395.8708506354,21183.895935385059,70161.859398825865,122726.14924768882,152989.0321587561,21764.77966,127600.41605999999,347752.03865999996,0,141488.02591075038,21502.644861651694,72304.827801152016,125367.05635156859,153339.90493394199,22331.943998999996,130164.28009199997,348168.3705989999,19.41,17.34,13290.980734972187,3891.732,901.88099999999997,null,8835,288,297,304,295,286,290,null,0,0]
[1498,"Tidaholm",2810399.8,null,12861,12840,12872,12902,12931,12958,22.07,22.07,null,19.41,17.34,null,347,999,783.79303751966904,915.70361304930429,12839,12839,699,1066,150,1325,398,2225,769,182,690,1080,143,1368,399,2210,787,193,12556,12565,12617,12669,12797,12827,12827,12828,12846,12790,12825,12839,1346,1408,1420,1455,1459,1475,761,731,734,722,705,699,12788,12855,12833,12814,12861,null,132471.15667604309,19541.026186736857,69184.320642917606,121810.41171757216,150273.75840757691,21653.740419999998,126019.73981999999,332983.81973999995,0,138236.46425901263,19830.738295115862,71313.902134116652,124392.23868630937,150226.00205165069,22090.006817999994,125992.16166599997,335859.68672099995,19.41,17.34,17640.348987555004,3115.453,706.56299999999999,null,12640,473,430,431,412,419,398,null,0,0]
[1499,"Falköping",7144728,null,33301,33073,33155,33232,33306,33376,21.95,21.95,null,19.41,17.34,null,3560,3376,556.159335582631,453.19690078477743,33252,32991,1959,2909,427,3690,1243,5263,1826,425,1872,2855,393,3641,1268,5262,1874,413,31689,31988,32185,32511,32806,33077,33077,33155,33246,33238,33270,33252,4044,4105,4151,4127,4165,4117,2089,2069,2066,2067,2047,1959,33145,33237,33290,33216,33301,null,135747.73660360763,19949.902909587192,70027.409604168992,125040.67355195945,145251.34080474055,22095.720139999998,132171.53143999999,347785.78587999998,0,141418.04871087542,20239.323584841175,72150.709328330195,127448.35523861977,145845.99953781665,22500.157832999994,132031.24597799996,346779.0489329999,19.41,17.34,37073.689737539295,7074.3789999999999,2095.5929999999998,null,31298,1138,1187,1249,1245,1239,1243,null,0,0]
[1715,"Kil",2659602.2000000002,null,12130,12093,12123,12151,12178,12204,21.87,22.35,null,19.97,17.899999999999999,null,1877,2324,185.913356378938,546.75449881599161,12115,12085,707,1102,150,1360,468,2214,678,136,697,1112,148,1385,449,2196,704,128,11782,11810,11885,11802,11800,11910,11910,11962,12087,12115,12134,12115,1405,1451,1490,1505,1502,1510,740,736,753,728,718,707,11976,12068,12089,12113,12130,null,135735.86209778886,21610.206075886981,70738.446819520424,124056.23858475838,156192.96943907184,21340.217859999997,123711.86541999999,338109.04269999999,0,141626.69587085038,21929.878143148762,72907.454893942006,126618.79753353073,159189.00100988627,21831.455924999995,125114.75000099996,341008.89908399992,19.97,17.899999999999999,18157.547917558983,3473.078,1146.009,null,11736,410,384,394,392,433,468,null,0,0]
[1730,"Eda",1582235.4,null,8536,8530,8551,8571,8590,8608,22.27,22.27,null,19.97,17.899999999999999,null,2273,2452,712.69487919185303,1082.1245228657699,8535,8499,454,688,92,856,239,1578,467,123,441,694,90,876,237,1574,485,122,8496,8426,8453,8505,8526,8618,8618,8575,8564,8550,8490,8535,870,908,919,957,942,948,535,507,516,485,459,454,8570,8569,8547,8471,8536,null,135616.29591275615,18396.966476182857,73296.647777218895,129656.33667762145,156178.36545977191,24533.140319999999,135594.15271999998,362174.07642,0,141410.04968413126,18667.394958878907,75550.081434850945,132540.91550406005,159199.39468851677,24557.143049999995,134360.28072899996,362652.41239199991,19.97,17.899999999999999,10094.326322495126,2673.692,122.941,null,8651,241,252,255,240,245,239,null,294,0]
[1737,"Torsby",2376614.6,null,11428,11378,11406,11433,11459,11483,22.02,22.02,null,19.97,17.899999999999999,null,5110,6723,1385.51455005767,1830.1135086078111,11411,11387,509,818,120,1013,286,2476,785,164,526,807,103,1039,322,2471,811,180,12219,12013,11992,11910,12169,11890,11890,11719,11616,11549,11472,11411,1081,1081,1074,1121,1093,1133,559,535,529,522,528,509,11732,11626,11545,11496,11428,null,133045.88500885104,18149.948023156652,76266.199947298839,134047.04740620859,160292.26900001219,27047.852519999997,151382.40857999999,384095.61735999997,0,139401.44843691611,18431.790436565923,78604.088248001382,137006.60846126042,160483.16151047737,27445.852223999995,154744.26699599996,379389.68887499993,19.97,17.899999999999999,18291.961369589313,5581.7849999999999,654.39099999999996,null,12888,371,359,341,284,300,286,null,13,0]
[1760,"Storfors",846622.2,null,3888,3785,3794,3803,3812,3820,22.7,22.7,null,19.97,17.899999999999999,null,482,535,-1566.35764737105,-2270.4921823900077,3882,3801,170,257,33,338,140,933,216,50,152,253,40,325,123,916,245,49,4150,4131,4106,4032,4046,4123,4123,4055,4014,3990,3948,3882,440,415,410,405,386,371,196,200,193,188,172,170,4081,4006,4007,3932,3888,null,132577.72299739,18251.563905547519,73704.569046267803,128839.4682109694,159931.8743549698,22429.926479999998,125393.78331999999,351085.39309999999,0,137469.94693020481,18501.963632525109,75940.683242936415,131411.88184781038,161997.870595199,22746.248441999993,123840.68596199997,350646.92875799991,19.97,17.899999999999999,4569.6422373474843,2252.5859999999998,57.194000000000003,null,4494,139,146,133,137,142,140,null,0,0]
[1761,"Hammarö",4401673.5999999996,null,16796,16940,16982,17021,17059,17095,22.92,22.92,null,19.97,17.899999999999999,null,1131,1997,337.07118964933699,403.63371234268561,16820,16940,1145,1862,263,2333,648,2537,741,127,1130,1860,259,2378,685,2579,779,136,15061,15136,15256,15420,15725,16174,16174,16483,16568,16668,16765,16820,2267,2365,2422,2509,2537,2596,1166,1188,1210,1200,1206,1145,16476,16571,16667,16782,16796,null,140817.18077275576,25169.417154632567,68341.850011583767,119893.63491354513,125424.82253243486,20986.416359999999,122602.56163999999,319641.69301999995,0,146817.05926174385,25537.565933954156,70430.429510367059,122401.67563510526,125398.77467168852,21384.962414999995,124422.16588199997,327713.77605599992,19.97,17.899999999999999,18916.333450223556,1503.46,2161.056,null,14558,597,605,583,593,625,648,null,0,0]
[1762,"Munkfors",714121.4,null,3700,3717,3726,3735,3743,3751,22.02,22.02,null,19.97,17.899999999999999,null,5838,4383,2932.3086941003498,2182.4584058819592,3701,3669,171,264,42,353,115,717,283,68,151,262,39,351,113,709,287,63,3642,3656,3656,3663,3738,3763,3763,3789,3740,3725,3680,3701,377,400,395,395,381,395,169,188,172,183,170,171,3782,3760,3721,3663,3700,null,134977.57978528982,18495.12945409623,74099.25785191539,131325.21143365116,162085.87825186024,25598.899299999997,136227.72955999998,344204.22607999999,0,139707.49997572551,18743.120427115929,76352.573994217993,133957.61017778891,161643.77982242382,25866.511226999995,137533.49972099997,338048.5432769999,19.97,17.899999999999999,1878.1951429916724,1243.4639999999999,4.2750000000000004,null,3904,110,105,94,104,119,115,null,315.62179999999995,0]
[1763,"Forshaga",2457355,null,11603,11545,11573,11600,11626,11651,21.87,22.35,null,19.97,17.899999999999999,null,901,1386,296.39854245409202,276.54349283160627,11578,11538,713,1052,179,1315,395,1941,666,119,668,1083,171,1358,406,1898,675,129,11311,11292,11379,11379,11451,11509,11509,11518,11499,11524,11606,11578,1426,1441,1410,1427,1452,1494,708,726,748,746,772,713,11504,11502,11492,11589,11603,null,136674.07652921387,21803.818528262786,69315.658463028347,121684.78423743305,158799.37027550369,20635.880719999997,120876.01031999999,324865.9804,0,142189.56275067091,22116.29786517681,71450.222492770496,124380.12376847753,156082.45854354274,20826.326348999995,121810.69802699998,321143.05295999994,19.97,17.899999999999999,14766.782486819051,5751.5529999999999,857.13699999999994,null,11459,379,398,405,425,399,395,null,0,0]
[1764,"Grums",1946678.3,null,9085,9040,9062,9083,9103,9122,22.5,22.5,null,19.97,17.899999999999999,null,734,723,402.11063692565199,722.99304750942611,9105,9057,482,707,108,903,283,1770,537,125,461,716,96,907,291,1738,571,111,8939,8925,8958,8945,9063,9011,9011,9016,9047,9043,9091,9105,941,951,980,985,1004,1011,504,497,522,484,467,482,9027,9036,9029,9090,9085,null,135190.32929986535,18730.709312656902,69793.122396574705,122305.26456432807,150583.08762478453,22979.67958,128115.33331999999,338915.71012,0,140826.89290894635,19002.959361959485,71918.628171170392,125064.25707034727,155094.66630738406,23664.156029999995,128332.61834399997,340016.22979199991,19.97,17.899999999999999,11007.855002846149,4072.6039999999998,292.34300000000002,null,9323,271,256,258,268,273,283,null,0,0]
[1765,"Årjäng",1833013.6,null,9909,9880,9904,9927,9949,9970,21.97,21.97,null,19.97,17.899999999999999,null,3205,3220,38.858556661177303,244.12729507112635,9914,9893,491,742,112,967,311,1857,582,130,478,717,107,946,310,1855,603,125,9864,9953,9804,9869,9958,9948,9948,10011,10070,9996,9942,9914,1088,1083,1088,1064,1058,1079,496,505,508,524,527,491,9973,10081,10017,9934,9909,null,134711.05034857581,18539.961913305808,75038.736742273293,132588.98144164644,167329.85241276096,24220.70638,138364.69061999998,348346.42517999996,0,140456.00036446258,18811.522161568562,77301.40853448835,135069.49649327126,166489.78904765812,24788.696660999994,141340.11648299996,358859.2942709999,19.97,17.899999999999999,17087.786488374673,2991.5709999999999,499.60300000000001,null,9879,357,356,361,341,335,311,null,4,0]
[1766,"Sunne",2910046.2,null,13430,13411,13444,13475,13505,13534,21.67,21.62,null,19.97,17.899999999999999,null,731,1038,1599.21569200355,1636.7170980375095,13418,13366,697,992,137,1277,414,2548,791,189,674,987,146,1274,414,2604,819,187,13102,13011,13099,13208,13425,13331,13331,13261,13306,13335,13355,13418,1355,1388,1360,1378,1414,1414,673,671,712,732,712,697,13286,13285,13318,13385,13430,null,133058.24043521442,20289.130145670515,73519.746323175816,128891.37990063969,169074.38570382525,23344.367279999999,135474.40451999998,341617.66495999997,0,138690.33662141362,20585.739082248045,75761.737447594918,131588.29125521969,169864.66164992124,23361.994142999993,136276.04939399997,340447.14794699993,19.97,17.899999999999999,21447.815801843011,4070.2620000000002,705.47,null,13556,453,425,420,407,408,414,null,0,0]
[1780,"Karlstad",23125482.600000001,null,96392,97144,97383,97609,97827,98034,21.27,21.27,null,19.97,17.899999999999999,null,-4087,-4175,-629.29233887169505,-620.72298989544288,96466,97233,5035,7319,1025,9401,3006,14328,4613,1003,4803,7385,1098,9401,3120,14406,4842,1014,86929,87786,88350,89245,90198,91120,91120,92497,93898,94828,95408,96466,9474,9778,9952,10187,10351,10426,4993,5111,5172,5125,5058,5035,92225,93774,94824,95282,96392,null,135055.12169959431,22199.106420288568,68189.611129860641,120561.09697971697,134564.3155820012,22890.41274,127310.84314,329525.27399999998,0,140519.17736345303,22516.792796082183,70259.86867706367,122986.90364380556,135333.80350265827,23012.067833999994,127334.75726699996,331493.39553599991,19.97,17.899999999999999,80367.872001269512,12230.231,8469.098,null,83564,2652,2690,2767,2822,2951,3006,null,0,0]
[1781,"Kristinehamn",5050267.3,null,24049,23859,23918,23974,24028,24079,21.97,21.97,null,19.97,17.899999999999999,null,569,980,23.681170072135501,-79.698399132649683,24053,23817,1115,1820,244,2366,744,4830,1464,314,1041,1806,259,2315,784,4771,1543,316,23729,23949,24114,24270,24671,24650,24650,24336,24255,24190,24099,24053,2606,2586,2606,2627,2637,2610,1299,1260,1194,1192,1154,1115,24391,24244,24220,24127,24049,null,134102.33895477097,20325.331544904202,69094.537567846535,122143.56471183979,147274.1729596598,23716.675319999998,135504.88587999999,339522.07145999995,0,139466.94927038846,20614.663382997434,71189.161224992436,124422.79288850576,144148.38034806791,24319.359296999995,136608.32363399997,342470.9057399999,19.97,17.899999999999999,28978.103892948049,7597.1310000000003,1520.143,null,23876,740,753,750,755,741,744,null,0,0]
[1782,"Filipstad",1955586.4,null,10326,10058,10083,10106,10129,10150,22.27,22.27,null,19.97,17.899999999999999,null,7603,9662,479.02685626651999,133.15273001341484,10315,10034,501,784,120,1001,309,2152,668,165,478,743,106,975,304,2148,689,178,10549,10563,10613,10625,10960,10783,10783,10837,10644,10503,10403,10315,1136,1181,1131,1112,1145,1121,546,588,579,557,538,501,10795,10671,10536,10409,10326,null,133626.65288512662,17491.692277109665,71021.005941675612,126530.17575550541,175901.43345468518,25023.019319999999,140814.08562,350543.26033999998,0,139390.72959042678,17749.456138128029,73177.077661002302,128863.34431341324,172332.40589907268,25287.108020999993,139605.02193599998,360753.25743899989,19.97,17.899999999999999,6240.5692387356758,2965.1060000000002,12.936999999999999,null,10798,372,381,390,368,309,309,null,0,0]
[1783,"Hagfors",2390115.2999999998,null,11581,11548,11576,11603,11629,11654,22.02,22.02,null,19.97,17.899999999999999,null,3144,3579,1004.1149083624,1306.6817671830404,11589,11536,464,796,113,1010,332,2532,842,177,483,750,84,1018,345,2520,885,171,12170,12071,11921,11824,11917,11782,11782,11698,11606,11517,11553,11589,1064,1070,1080,1053,1059,1123,485,463,449,466,469,464,11712,11613,11518,11569,11581,null,130829.75173691876,18495.453931157426,73002.442210684385,129082.02794059349,157131.66990163003,23746.068059999998,138280.86687999999,360986.39199999999,0,137267.47825042432,18785.399682285191,75218.703476303621,131671.62231281147,156886.11204755009,23850.021932999993,137067.27742799997,364988.71564199991,19.97,17.899999999999999,8233.756876436144,4396.308,25.652000000000001,null,13005,357,355,341,333,345,332,null,262.93819999999999,0]
[1784,"Arvika",5543638.2999999998,null,25851,25703,25766,25826,25884,25939,21.75,21.75,null,19.97,17.899999999999999,null,1260,1922,-114.32525822281001,102.75933537727906,25832,25682,1294,2037,296,2556,798,4970,1593,422,1257,2035,275,2589,826,4923,1658,422,25829,25817,25771,25841,26054,26060,26060,26082,26045,25932,25854,25832,2672,2728,2783,2820,2846,2852,1444,1451,1414,1371,1359,1294,26087,26101,25932,25882,25851,null,133373.43899767025,19966.792455551575,71810.633064404348,126272.13759192203,149461.18936537855,23055.882979999998,131091.62039999999,338128.63785999996,0,139088.1327801903,20260.373144336085,74008.295762038964,128978.25773066959,147923.82579891605,23491.788767999995,132044.74461899998,340217.67104999995,19.97,17.899999999999999,39491.494262760592,6765.4979999999996,1800.615,null,26252,832,822,811,784,780,798,null,0,0]
[1785,"Säffle",3075593.4,null,15247,15030,15067,15102,15136,15168,21.52,21.52,null,19.97,17.899999999999999,null,3382,3650,806.78894313603803,509.92332840593099,15242,15011,755,1091,164,1430,535,2995,1064,239,713,1065,149,1419,540,2991,1111,224,15308,15276,15334,15366,15633,15727,15727,15643,15455,15420,15396,15242,1724,1707,1685,1664,1603,1594,802,801,785,776,796,755,15688,15435,15444,15445,15247,null,134025.56177575633,18802.546279347313,71523.21543593872,126466.77740629454,150760.35005512126,22732.562839999999,129835.35291999999,337886.96421999997,0,139575.3176971045,19074.417378881841,73701.100703817938,128953.70913694183,151204.80131240157,22832.432072999996,130728.10794299997,344225.72906999994,19.97,17.899999999999999,16709.653634365979,5566.3549999999996,470.33800000000002,null,15879,516,533,531,517,534,535,null,0,0]
[1814,"Lekeberg",1966401.9,null,8736,8630,8651,8671,8690,8708,22.43,22.43,null,19,16.93,null,2157,3183,422.473454936206,-441.33125981098328,8756,8606,639,906,142,1116,267,1327,426,75,603,891,129,1149,288,1325,426,72,7298,7289,7363,7492,7636,7868,7868,8116,8234,8472,8603,8756,1050,1085,1110,1191,1217,1258,553,613,637,617,644,639,8069,8235,8446,8591,8736,null,135877.8083790761,21467.831634807917,70743.316732348583,124370.57102231057,152479.88510050235,21050.644939999998,124361.77155999999,334825.76477999997,0,141533.95573344702,21778.970968408568,72925.721107096077,127102.74789032477,151521.9431442506,21669.472232999993,127977.50024999997,348372.92692799994,19,16.93,13174.139436683377,2875.326,754.23,null,7097,216,237,258,264,268,267,null,0,0]
[1860,"Laxå",1166470.2,null,5586,5493,5507,5520,5532,5544,22.18,22.18,null,19,16.93,null,2978,3586,842.510823380695,967.53419053894049,5576,5497,260,428,59,549,169,1188,361,79,250,408,53,555,167,1200,383,72,5552,5580,5664,5656,5709,5643,5643,5637,5683,5659,5582,5576,567,585,589,571,592,608,250,256,280,311,276,260,5669,5685,5653,5585,5586,null,136842.28500050236,18632.111597705181,72101.785772837073,129041.93484117395,165858.31595894578,23465.204099999999,133182.85941999999,358547.88319999998,0,142682.30765067579,18904.687179036995,74313.226892217368,131706.22101600218,157984.77274876749,24014.082338999993,137250.02825999996,357654.80015099992,19,16.93,6421.953736555718,2892.5419999999999,91.471999999999994,null,5941,193,189,184,186,167,169,null,0,0]
[1861,"Hallsberg",3521082.2,null,16263,16258,16298,16336,16373,16408,21.55,21.55,null,19,16.93,null,1674,1584,-596.09741349459796,-298.08621916406355,16290,16232,1007,1429,210,1814,570,2735,793,149,977,1415,201,1834,580,2704,847,134,15283,15267,15315,15509,15649,15932,15932,15954,15932,15990,16196,16290,1907,1930,1936,1972,2005,2024,928,966,983,1007,1003,1007,15919,15950,16001,16158,16263,null,136930.14651127765,19474.828159275614,70385.742617106662,125668.16472677323,158383.76687689748,22650.91634,135417.79627999998,351161.59649999999,0,142741.51825993709,19759.795297729139,72537.684926326736,128194.2252115466,159307.34501290965,23207.278949999996,134821.31123699996,351416.35129499994,19,16.93,21377.083859645183,6034.0280000000002,1150.1510000000001,null,15274,510,525,517,534,535,570,null,0,0]
[1862,"Degerfors",2024795.2,null,9529,9409,9432,9454,9475,9495,23,23,null,19,16.93,null,1507,1483,922.54517192392302,658.02234236819913,9530,9357,450,698,89,909,307,2005,599,128,449,679,96,879,295,1929,660,110,9477,9500,9531,9543,9609,9668,9668,9665,9666,9631,9534,9530,1011,1003,1005,1007,987,998,421,440,449,458,454,450,9608,9663,9633,9564,9529,null,136905.45520916476,19301.3221750788,69704.28639162227,123513.87151825898,156915.24090522516,22397.267879999999,130574.52589999999,341356.39616,0,143190.6399628263,19594.834033886826,71814.976594274282,126098.35853761698,157706.41928483371,23390.029781999994,131215.09737599996,349463.20177799993,19,16.93,7697.2408414939418,3307.2550000000001,64.5,null,9925,339,319,327,323,323,307,null,0,0]
[1863,"Hällefors",1309628.7,null,6663,6519,6535,6550,6565,6579,22.05,22.05,null,19,16.93,null,9459,9131,634.28861557619405,-125.54478226817173,6656,6495,333,490,80,640,209,1375,505,86,291,494,78,614,209,1337,529,87,6988,6982,6936,7032,7138,7109,7109,6983,7013,6896,6849,6656,696,696,753,734,722,720,368,366,368,374,356,333,7012,6995,6882,6880,6663,null,133876.15163018697,18146.039378081427,69948.454461870904,125162.24343192017,165686.10753761648,25824.243639999997,139445.69027999998,342871.75519999996,0,138711.86331158911,18392.963416220064,72060.566676612696,127430.34170770035,160301.53529855103,25793.826236999994,137429.66402099998,354418.24138199992,19,16.93,7345.6256299781535,2003.9079999999999,51.863,null,7479,228,217,205,207,199,209,null,476.9502,0]
[1864,"Ljusnarsberg",897481.6,null,4503,4429,4440,4450,4460,4469,21.5,21.5,null,19,16.93,null,6569,7782,-261.58490927297998,-225.12616919272568,4517,4407,192,270,38,349,131,1053,348,65,166,254,35,338,130,1043,361,73,4848,4875,4913,4928,5006,4942,4942,4846,4771,4674,4604,4517,478,449,432,422,404,387,212,209,204,181,200,192,4856,4748,4689,4613,4503,null,135771.31110270054,18298.40034331131,71905.844807357469,126632.62392795357,159041.30785371337,26613.493139999999,133446.30546,354339.27827999997,0,140373.98171945207,18538.499868208761,74078.000308999748,128943.43795660936,157396.97490496928,26744.961248999993,136221.01647299997,345506.02325099992,19,16.93,4618.7040303311387,1928.9690000000001,14.387,null,5192,164,158,146,137,132,131,null,352.59339999999997,0]
[1880,"Örebro",36929086,null,157919,159437,159830,160202,160560,160899,21.35,21.35,null,19,16.93,null,-1885,-2336,1408.8772099841999,1509.9189169641013,158057,159348,8957,13464,1825,17446,5271,21538,6398,1399,8742,13247,1791,17350,5521,21487,6799,1380,138952,140599,142618,144200,146631,150291,150291,153367,155696,156381,156987,158057,17463,18134,18656,18989,19163,19271,9448,9409,9458,9305,9067,8957,153088,155592,156517,156946,157919,null,136186.54173975679,21110.044361180906,68198.936295667794,122088.81627874373,133394.24794677758,23215.910119999997,127348.94484,332787.86813999998,0,141910.83572301242,21416.85417607407,70261.956878045428,124441.8565978687,132945.92486898822,23479.328483999994,127062.70773299997,332148.59880299994,19,16.93,120330.03541732514,13279.934999999999,12637.813,null,130254,4941,5021,5047,5073,5146,5271,null,0,0]
[1881,"Kumla",5008509.8,null,22473,22517,22573,22625,22676,22724,21.6,21.54,null,19,16.93,null,202,945,1340.67506690305,1423.608615414797,22479,22516,1390,2204,304,2812,807,3333,1032,195,1400,2165,297,2830,828,3253,1126,196,20738,20904,21016,21154,21334,21506,21506,21640,21738,21862,22144,22479,2856,2906,2947,3020,3034,3116,1389,1408,1411,1380,1412,1390,21653,21685,21842,22092,22473,null,136986.99878259821,20899.868279147806,68150.673871592895,120954.53379742391,139990.02684139056,22252.48142,124860.35952,337163.03191999998,0,143048.25210735295,21211.189138234204,70228.106737405978,123626.76678540985,140151.79031759902,22748.325155999995,124366.09460399997,337896.94315499993,19,16.93,24635.540096992667,3274.6869999999999,2277.7080000000001,null,19768,818,825,813,808,816,807,null,0,0]
[1882,"Askersund",2686152.3,null,11488,11477,11505,11532,11558,11582,21.85,21.85,null,19,16.93,null,-1386,-1296,-22.250630158438099,-63.424784735942012,11497,11478,560,829,122,1049,389,2521,734,135,557,793,95,1056,379,2501,781,133,11011,11096,11119,11151,11282,11175,11175,11313,11377,11471,11534,11497,1155,1195,1199,1206,1178,1171,533,539,551,574,589,560,11318,11361,11431,11527,11488,null,131768.64334315286,18853.200365071512,73225.528026325148,128036.01515840179,154295.67890183505,21584.068739999999,131621.77833999999,327037.77729999996,0,137606.92069262202,19134.391274016754,75446.782643805112,130730.56257003632,158752.6575971444,21675.702374999993,130360.52956499998,325953.7609409999,19,16.93,21168.058325480797,5888.6419999999998,1127.6880000000001,null,11404,363,347,338,346,385,389,null,0,0]
[1883,"Karlskoga",7023749.4000000004,null,30308,30297,30372,30443,30511,30576,22,22,null,19,16.93,null,519,760,370.71505395516101,332.37609751267064,30278,30261,1529,2284,310,3041,1025,5311,1894,363,1519,2270,320,3006,1055,5235,1999,368,29631,29728,30054,30283,30538,30413,30413,30419,30381,30263,30437,30278,3365,3393,3356,3314,3396,3351,1570,1571,1543,1518,1517,1529,30395,30384,30267,30381,30308,null,133629.75632033122,19631.136613716364,68004.701586624346,120924.23298632304,145407.53740784578,22670.511499999997,132461.10436,344558.02757999999,0,139522.89998101938,19923.814525022728,70065.080189607208,123398.13515986381,145574.26661790401,23025.566474999996,132862.96993499997,341982.87794999994,19,16.93,30318.692985664526,8991.4390000000003,2022.3520000000001,null,29988,1058,1060,1093,1094,1037,1025,null,0,0]
[1884,"Nora",2406313.9,null,10705,10628,10654,10679,10703,10726,22.25,22.25,null,19,16.93,null,1168,1603,914.38736005810199,740.68542410375812,10701,10627,571,863,115,1144,361,2192,696,107,542,849,138,1105,385,2156,746,101,10356,10399,10352,10502,10665,10747,10747,10737,10726,10686,10721,10701,1240,1264,1289,1295,1273,1259,570,581,580,588,553,571,10712,10725,10703,10710,10705,null,134394.09999371134,20358.623711364984,69940.876908781662,124196.76986635257,147448.02983441702,22772.841779999999,127479.57923999999,357086.95515999995,0,139928.90496810013,20652.056425088409,72056.024045785045,126384.24387707505,147149.12235893181,22759.747082999995,129168.49572899997,365217.15418199991,19,16.93,15648.043902365507,3112.1590000000001,750.53200000000004,null,10454,359,374,346,322,337,361,null,0,0]
[1885,"Lindesberg",5159432.3,null,23483,23319,23376,23430,23482,23532,22.3,22.3,null,19,16.93,null,1297,1662,2429.6897496246102,2464.0688001827975,23435,23292,1236,1884,276,2469,767,4425,1291,300,1219,1865,267,2427,802,4364,1387,286,22979,23176,23269,23562,23744,23613,23613,23575,23588,23658,23601,23435,2667,2700,2706,2741,2761,2745,1317,1313,1338,1305,1290,1236,23591,23611,23651,23641,23483,null,133668.4760101666,19099.48013083365,70344.739841496877,125069.74284497497,146122.84509814536,22794.614179999997,130758.50267999999,345900.29603999999,0,139537.277451045,19383.58557849436,72474.617500246648,127519.80546072437,147418.09286917705,23244.659801999995,130361.56792199997,348093.6088949999,19,16.93,31556.035961458201,7957.1629999999996,1286.386,null,23075,833,799,789,777,778,767,null,0,0]
[1904,"Skinnskatteberg",920377.6,null,4406,4350,4361,4371,4381,4390,22.46,22.46,null,20.190000000000001,18.12,null,2843,3572,-1379.0138117471299,-1722.699296052182,4402,4348,193,325,37,408,144,982,272,53,172,324,43,411,139,975,288,55,4392,4411,4434,4472,4429,4431,4431,4429,4393,4366,4371,4402,435,449,442,440,449,445,239,217,197,196,192,193,4410,4371,4373,4376,4406,null,132628.23468972198,17976.200769498617,74008.318161995368,130487.15935000373,151008.10159702614,23821.182839999998,134991.05723999999,352864.19817999995,0,137389.69595068705,18220.080724639171,76286.937131427403,133295.23689505615,155219.31551061146,23893.632926999995,135592.81048799996,366939.7884449999,20.190000000000001,18.12,6754.2173225788392,3969.0259999999998,145.97999999999999,null,4709,139,125,141,130,151,144,null,395.97359999999998,0]
[1907,"Surahammar",2205807.2000000002,null,10029,9946,9971,9994,10016,10037,22.31,22.31,null,20.190000000000001,18.12,null,355,840,-1690.00526709357,-2020.1553990267003,10033,9934,542,911,134,1128,343,1842,559,113,504,889,127,1146,362,1825,602,107,9890,9834,9918,9985,10059,10037,10037,10088,10106,10092,10099,10033,1169,1189,1165,1206,1232,1262,563,584,600,593,582,542,10038,10065,10100,10100,10029,null,134088.12726362632,19693.951949545663,68923.984066966426,122482.5713485889,153415.89106005369,22057.618439999998,129214.83951999999,338627.22581999999,0,139440.31703212799,19973.587195767894,71039.679672684797,124925.00260666545,151097.46797199338,22111.812314999996,127752.17678099997,341592.4557179999,20.190000000000001,18.12,12122.168821703361,3705.5010000000002,854.322,null,10098,355,362,357,325,343,343,null,0,0]
[1960,"Kungsör",1918489.6000000001,null,8752,8669,8690,8710,8729,8747,22.03,22.03,null,20.190000000000001,18.12,null,1756,1723,4288.0533585085896,3882.7155950664501,8762,8643,527,739,96,989,312,1533,463,96,499,733,106,957,303,1540,469,98,8030,8175,8269,8343,8432,8603,8603,8667,8675,8745,8787,8762,1029,1051,1064,1070,1066,1085,485,514,513,512,506,527,8661,8637,8729,8810,8752,null,135980.89657337134,20063.398894100996,68771.536501820709,123276.36773300174,158908.8709724498,21125.759719999998,126039.33497999999,325950.24591999996,0,141637.34842806871,20354.283234671948,70854.565266366757,125816.06079168596,162538.54811172225,21793.036715999995,125589.27914999997,334801.6009379999,20.190000000000001,18.12,11198.952456446057,2661.14,933.78300000000002,null,8238,336,325,322,322,332,312,null,0,0]
[1961,"Hallstahammar",3627856.8,null,16702,16664,16705,16744,16781,16816,21.81,21.81,null,20.190000000000001,18.12,null,1351,1711,2274.2178271206999,2444.8331579879423,16711,16654,992,1461,207,1837,572,2770,990,184,980,1415,197,1869,553,2711,1021,186,15346,15524,15596,15645,15843,15998,15998,16186,16346,16400,16608,16711,1820,1868,1948,1989,1993,2044,956,973,962,952,992,992,16143,16301,16409,16560,16702,null,135380.84120683119,19972.429341711766,68944.92465092674,123017.32141543216,145302.89381968931,23052.617119999999,126692.50697999999,343212.49325999996,0,141273.55904888848,20267.777566222529,71057.499805167972,125607.85616142077,143858.42231477701,23382.761282999996,128690.85150899997,336755.7888119999,20.190000000000001,18.12,17735.093774413832,2468.451,1701.528,null,15059,531,527,529,539,559,572,null,79.889399999999966,0]
[1962,"Norberg",1217998.2,null,5626,5530,5544,5557,5569,5581,22.66,22.66,null,20.190000000000001,18.12,null,2326,1462,-879.836296398527,-1186.485559507817,5627,5517,291,419,55,561,201,1185,327,74,265,422,74,542,182,1169,353,70,5630,5608,5719,5803,5795,5796,5796,5795,5690,5729,5714,5627,619,649,641,635,633,616,293,294,285,294,302,291,5800,5717,5725,5706,5626,null,135143.7928491226,19336.756126757722,69487.787539782061,123239.48576113323,157913.70598087602,23483.710639999998,130576.70314,340232.94031999999,0,140435.82896100119,19609.705800846263,71606.983555284169,125693.76393647387,159312.18069023686,23823.024650999996,128834.14477499996,324265.39245899994,20.190000000000001,18.12,5258.1706208816049,2473.8339999999998,72.016000000000005,null,5790,203,195,178,190,189,201,null,0,0]
[1980,"Västerås",39210409.100000001,null,158500,159663,160057,160429,160788,161128,20.36,20.36,null,20.190000000000001,18.12,null,-332,-328,-780.201257207656,-731.40531038233439,158653,159662,9374,13312,1911,17042,5639,21932,7309,1573,9199,13348,1921,17104,5775,21913,7699,1594,140499,142131,143702,145218,147420,150134,150134,152078,154049,155551,156838,158653,17622,18115,18305,18604,18760,18953,9011,9103,9211,9317,9387,9374,151855,153935,155574,156684,158500,null,136988.25474350856,21249.951809732127,67797.515083553066,121788.11731623379,132347.72759444351,22786.993839999999,125706.21725999999,327069.34727999999,0,142813.14152688292,21561.157378105017,69858.214516448104,124328.66096230087,131663.64648156278,23122.133675999994,125632.89014399998,329016.91409099993,20.190000000000001,18.12,113594.63041268619,10765.172,13840.784,null,133680,4909,5069,5280,5435,5555,5639,null,0,0]
[1981,"Sala",4990569,null,22994,22905,22961,23014,23065,23114,22.31,22.31,null,20.190000000000001,18.12,null,720,1160,118.096560020681,188.94148789386873,22981,22853,1187,2016,281,2550,703,4268,1277,269,1122,1991,276,2544,765,4247,1351,282,21596,21769,21925,22109,22353,22631,22631,22816,22894,22867,22998,22981,2582,2661,2663,2728,2797,2831,1251,1295,1285,1251,1231,1187,22797,22881,22859,22972,22994,null,134273.07939055725,19847.603669730932,70924.156829560714,126050.67238490908,149675.98947935802,22817.475199999997,130685.56513999999,335908.94167999999,0,139747.23891713386,20132.286623133441,73084.99779453619,128524.25707871592,149141.26147825443,22938.344486999995,129327.36434999997,336252.1856669999,20.190000000000001,18.12,29597.081944750964,5484.884,2008.3810000000001,null,21402,762,730,726,708,711,703,null,0,0]
[1982,"Fagersta",2897097.9,null,13362,13271,13304,13335,13365,13393,22.11,22.11,null,20.190000000000001,18.12,null,5109,5561,-1.82693807662508,85.661514691382763,13341,13222,751,1215,161,1546,509,2249,784,161,717,1207,167,1556,494,2258,777,169,12634,12872,13133,13286,13445,13415,13415,13464,13391,13267,13319,13341,1566,1630,1655,1650,1695,1707,821,818,808,768,747,751,13447,13386,13286,13306,13362,null,138810.83698134311,18899.392642571449,68321.467933139109,124107.58682242829,142332.18257490449,24290.378059999999,136650.11411999998,349303.32215999998,0,144614.3706837832,19173.954138021054,70414.973956830567,126650.15017571018,143576.42220833348,24842.691224999995,136677.89355299997,351259.55938799994,20.190000000000001,18.12,11774.561272192017,5334.6329999999998,431.62799999999999,null,12173,452,436,421,443,468,509,null,0,0]
[1983,"Köping",5700817.5,null,26125,25951,26015,26075,26133,26188,22.16,22.16,null,20.190000000000001,18.12,null,1594,1944,348.21341241727703,361.05811884727882,26120,25978,1412,2173,311,2776,929,4589,1495,335,1373,2136,299,2775,909,4557,1539,357,24854,25237,25376,25557,25950,26116,26116,26268,26214,26085,26133,26120,2980,3048,3107,3104,3094,3087,1481,1508,1498,1476,1459,1412,26223,26226,26160,26122,26125,null,135325.21501931633,19134.119518615917,68574.84185148534,123161.99297194024,144208.58851619129,23140.795339999997,127550.33953999999,344342.48082,0,141116.41605269222,19415.00918780885,70663.969117349028,125624.82737742369,144798.58582422309,23721.265664999995,127483.24231799998,339220.84832999989,20.190000000000001,18.12,28668.053031440275,4303.3689999999997,2160.7620000000002,null,24636,865,892,857,897,893,929,null,0,0]
[1984,"Arboga",3119356.5,null,14088,14016,14051,14084,14116,14146,22.41,22.41,null,20.190000000000001,18.12,null,-201,254,-335.21169662951502,-661.93532951043198,14083,14002,741,1088,161,1352,454,2626,912,189,700,1100,163,1389,436,2588,978,194,13353,13493,13631,13858,13903,13934,13934,14138,14087,14039,14100,14083,1486,1495,1476,1468,1514,1513,725,772,758,752,756,741,14121,14115,14013,14085,14088,null,134868.21491874705,20354.815991582655,68724.237536914748,121562.13220301738,145414.44905824793,22391.824779999999,127904.14103999999,330852.30177999998,0,140373.55529213793,20647.667117665394,70845.1199283514,124215.24761501532,148035.49294416662,22512.618116999995,124811.54975699997,334299.03614999994,20.190000000000001,18.12,15987.289148879305,4143.9560000000001,1170.2149999999999,null,13352,495,519,521,506,474,454,null,0,0]
[2021,"Vansbro",1384151.8,null,6788,6734,6751,6767,6782,6796,22.3,22.29,null,19.510000000000002,17.440000000000001,null,5257,5322,994.96990279100305,1313.3121427042106,6800,6728,304,497,68,692,216,1317,448,80,292,490,70,667,237,1302,476,75,6779,6730,6694,6715,6884,6837,6837,6807,6805,6801,6776,6800,746,735,741,748,754,760,333,332,316,313,309,304,6789,6792,6807,6764,6788,null,130292.05345301495,18070.895851239311,72238.878594419017,127046.434844654,172620.82778602146,25547.734159999996,146068.85436,380676.26194,0,135819.86059376496,18335.241476191943,74415.659968911932,129518.55730152184,164904.30367855111,25705.565891999995,145484.19926999995,377398.12014899991,19.510000000000002,17.440000000000001,7265.3209374472353,5221.1580000000004,31.821999999999999,null,6964,246,231,209,214,202,216,null,0,0]
[2023,"Malung-Sälen",2277498.2999999998,null,10215,10196,10221,10245,10268,10290,22.57,22.56,null,19.510000000000002,17.440000000000001,null,337,-1,-225.33216724122701,-377.44975817263276,10258,10260,451,699,90,935,302,2023,653,136,432,692,109,914,318,2016,676,135,10178,10061,9969,10036,10091,10114,10114,10106,10138,10177,10218,10258,1022,1030,1041,1056,1047,1025,462,476,474,483,475,451,10111,10087,10112,10159,10215,null,131820.81339698361,18185.438013200903,73994.653406894358,130045.63885235433,157635.08296269341,23590.395399999998,137149.79069999998,329074.58531999995,0,137250.05846072928,18447.689568799946,76234.020367772668,132502.87648602956,154241.97312779675,24474.074489999995,134448.54107399998,343402.31196899991,19.510000000000002,17.440000000000001,42009.445293538229,10461.907999999999,2621.904,null,10420,325,305,290,287,294,302,null,1182,0]
[2026,"Gagnef",2292405.5,null,10487,10438,10464,10488,10511,10533,22.29,22.28,null,19.510000000000002,17.440000000000001,null,928,1124,350.768657713805,354.21870484982992,10499,10430,659,934,128,1212,348,1999,581,107,606,958,162,1193,365,2029,600,118,10012,10023,10024,10079,10175,10241,10241,10271,10304,10378,10502,10499,1238,1310,1295,1319,1347,1340,631,638,631,631,669,659,10251,10311,10376,10497,10487,null,135904.91223143073,21062.419734831125,72062.207003867967,126150.78964011032,153141.21401117637,20424.688439999998,125770.44583999999,344908.56321999995,0,141262.88914204057,21360.91560399915,74261.747616222565,128498.14826610107,156187.78421607468,20773.370141999996,124880.08131899998,328855.96875599993,19.510000000000002,17.440000000000001,20749.397397046396,5880.1369999999997,817.27599999999995,null,10071,376,338,350,347,366,348,null,0,0]
[2029,"Leksand",3637971,null,16119,16081,16121,16158,16194,16228,21.82,21.81,null,19.510000000000002,17.440000000000001,null,-1064,-870,-2596.2881072778,-2880.5617088857211,16113,16043,769,1239,176,1606,508,3505,1055,227,738,1245,180,1611,488,3456,1133,224,15146,15157,15252,15326,15507,15640,15640,15804,15807,15801,16012,16113,1643,1694,1702,1692,1741,1782,786,816,802,788,798,769,15773,15818,15782,16014,16119,null,132109.61518731836,20872.552916005141,70064.698383017196,123077.08945201218,141905.92818568656,21950.933679999998,124925.67671999999,334925.91781999997,0,137632.73884266012,21176.046587030844,72204.319238429365,125645.80454741823,141954.54919758116,22245.760367999996,125951.66574299998,334488.01712399995,19.510000000000002,17.440000000000001,35435.054813981042,7209.5069999999996,2667.5810000000001,null,15370,520,492,493,510,525,508,null,0,0]
[2031,"Rättvik",2390836.2000000002,null,11138,11082,11109,11135,11160,11184,21.82,21.81,null,19.510000000000002,17.440000000000001,null,2034,1864,683.04484165176098,910.72271425589679,11092,11042,476,677,87,918,352,2669,850,191,452,671,105,882,334,2655,892,198,10799,10766,10748,10759,10856,10837,10837,10907,10950,11047,11103,11092,1070,1041,1027,1032,1011,1005,402,431,447,427,455,476,10897,10964,11028,11089,11138,null,131508.50342405145,20082.157370824287,71564.262140275547,124560.06603740323,157612.14443672835,23249.657339999998,127930.26791999998,341401.02957999997,0,136883.0655568917,20370.668328618671,73713.078425968313,126829.44476001096,157840.51888067339,23528.131262999996,125191.58841899996,346909.88191499992,19.510000000000002,17.440000000000001,23367.328008901219,6090.8630000000003,1250.731,null,10887,312,330,333,365,356,352,null,0,0]
[2034,"Orsa",1420006.6,null,6926,6920,6937,6953,6969,6984,22.32,22.31,null,19.510000000000002,17.440000000000001,null,3437,2998,-1015.01130701738,-1355.2812128258111,6934,6908,328,457,64,609,218,1421,453,102,307,457,65,607,218,1404,471,95,6835,6849,6812,6750,6861,6887,6887,6892,6911,6877,6918,6934,704,693,692,670,670,673,278,292,295,297,319,328,6897,6920,6898,6926,6926,null,137232.80176031945,19133.100009885708,69779.407057288903,122843.10191555406,163261.16780112925,23564.268519999998,137282.60233999998,325531.12721999997,0,142696.18938349161,19404.734942671832,71902.357939773487,125364.11982071164,164907.51562872654,24062.885117999995,135769.33117799996,343796.88762899995,19.510000000000002,17.440000000000001,13717.888835466782,4847.5839999999998,598.79399999999998,null,7047,251,244,239,231,211,218,null,391.69659999999999,0]
[2039,"Älvdalen",1444681.7,null,7012,6923,6940,6956,6972,6987,22.79,22.78,null,19.510000000000002,17.440000000000001,null,6636,6668,-1958.50583342097,-2238.3295424451535,7018,6929,313,504,59,687,252,1420,495,96,275,479,64,653,244,1432,511,103,7139,7096,7052,7035,7039,7068,7068,7121,7031,7033,7042,7018,800,802,775,752,757,746,289,302,306,293,303,313,7114,7029,7034,7029,7012,null,132437.8387486685,18504.001281122863,76644.442877969457,134301.20428262584,167447.52039914569,26217.23546,145453.78405999998,358933.25467999995,0,137013.08014308376,18749.248599203347,78945.456658452938,136564.85638336453,170774.76445398861,26415.802079999994,144654.55202699997,349053.05076299992,19.510000000000002,17.440000000000001,22180.15317944764,10692.545,937.36699999999996,null,7375,232,231,232,250,246,252,null,2161.3645999999999,0]
[2061,"Smedjebacken",2460525.7999999998,null,10953,10956,10983,11009,11034,11057,22.46,22.45,null,19.510000000000002,17.440000000000001,null,-1076,-641,-347.69678000725202,258.4648065986612,10922,10913,517,861,125,1089,345,2432,675,111,522,825,101,1097,343,2419,712,120,10650,10691,10712,10790,10909,10894,10894,10897,10894,10854,10933,10922,1140,1162,1187,1202,1203,1214,581,572,570,539,539,517,10881,10886,10842,10935,10953,null,133599.06156352136,19663.187635839913,70611.208351564928,123839.81371829196,147330.8207508249,21061.531139999999,130876.07363999999,352643.20831999998,0,139669.78326619367,19959.11687396139,72755.689484857256,126320.57384963719,150481.14578432552,21275.934929999996,128834.14477499996,343013.9664509999,19.510000000000002,17.440000000000001,18441.434397032444,6933.9290000000001,640.41,null,10728,308,291,300,316,349,345,null,276.69439999999997,0]
[2062,"Mora",4597018.3,null,20669,20560,20611,20659,20705,20749,22.34,22.33,null,19.510000000000002,17.440000000000001,null,566,1099,1967.9630231961401,1721.3837628145366,20679,20536,951,1523,229,2021,718,4267,1320,238,939,1515,211,2008,733,4243,1379,245,20082,19998,20006,20101,20279,20369,20369,20390,20470,20492,20670,20679,2262,2279,2298,2292,2270,2250,986,979,981,981,966,951,20358,20414,20490,20603,20669,null,132340.51431546829,20758.341033398352,69741.789531297967,122083.42777193971,146377.24619355376,23453.22928,127666.82187999999,338989.73627999995,0,138208.33585085478,21068.376938523539,71859.48296428466,124638.60586705645,145298.6771968868,23634.043676999994,128798.84063699997,341018.24429699994,19.510000000000002,17.440000000000001,41589.274361825148,10665.351000000001,2616.7530000000002,null,20131,589,619,612,638,681,718,null,112,0]
[2080,"Falun",14495682.5,null,59855,59968,60116,60256,60391,60519,22.07,22.06,null,19.510000000000002,17.440000000000001,null,-612,-401,576.11576825495899,511.71921043090697,59818,59986,3392,5137,757,6561,2117,10189,3079,633,3333,5108,683,6633,2169,10218,3214,637,56432,56767,56896,57062,57685,58340,58340,58923,59406,59528,59837,59818,6891,7089,7119,7199,7234,7318,3448,3440,3536,3472,3487,3392,58888,59382,59537,59788,59855,null,135390.12230972486,21649.059212803339,69216.106646003347,121995.12263766346,138863.30483623446,22593.21948,126399.66819999999,330373.30897999997,0,141190.99589837622,21966.925258258936,71323.971032975198,124556.3194661421,138544.2265365718,22840.738928999996,126608.94572399998,329369.95547099994,19.510000000000002,17.440000000000001,75039.838103849906,12807.001,6897.5940000000001,null,55230,1893,1922,1957,2018,2135,2117,null,0,0]
[2081,"Borlänge",11472478.1,null,52208,51774,51902,52023,52139,52249,22.42,22.41,null,19.510000000000002,17.440000000000001,null,2246,2114,1431.5504096376401,1404.3076462508188,52178,51735,3059,4540,661,5842,2008,7924,2474,482,2878,4406,623,5738,1973,7873,2620,499,49482,50023,50715,50988,51604,51964,51964,52224,52590,52394,52254,52178,6488,6544,6600,6605,6518,6503,3249,3263,3347,3270,3156,3059,52153,52505,52439,52260,52208,null,136294.49275022952,19472.370992248907,68158.469049376319,122445.81460155033,141072.26061879101,23448.874799999998,130712.78064,337343.74283999996,0,141852.45568960224,19751.492899609791,70222.845705304033,124813.87225830994,141616.7073688448,23874.942500999994,131138.25895799996,345079.25852399995,19.510000000000002,17.440000000000001,61483.097865044467,6389.9440000000004,5280.7849999999999,null,47717,1810,1877,1928,1981,1977,2008,null,0,0]
[2082,"Säter",2544405.2000000002,null,11263,11256,11284,11310,11335,11359,22.32,22.32,null,19.510000000000002,17.440000000000001,null,-330,551,-403.39185550304302,-510.38031224109454,11271,11243,627,927,148,1167,377,2266,652,123,602,946,147,1187,352,2259,694,127,10851,10873,10886,11009,11086,11160,11160,11123,11093,11161,11242,11271,1237,1245,1259,1258,1276,1315,641,661,656,631,656,627,11143,11112,11147,11227,11263,null,135703.85044420799,20838.642861628297,70001.983275876832,122628.8942129246,148714.66942409641,22510.484359999999,128338.50042,339365.31017999997,0,141372.00517497867,21141.834180952297,72148.166959992974,125222.64842131647,154448.01793879049,22921.730774999993,129441.58361999998,346784.24071799993,19.510000000000002,17.440000000000001,23324.049651212743,3205.4859999999999,1218.0609999999999,null,10982,345,332,326,360,362,377,null,0,0]
[2083,"Hedemora",3295890.3,null,15441,15336,15374,15410,15444,15477,22.17,22.16,null,19.510000000000002,17.440000000000001,null,1661,1781,671.74044565808197,428.66486020025513,15443,15345,818,1172,164,1564,508,3020,895,183,760,1167,183,1540,523,3027,939,202,15064,15021,15085,15235,15461,15566,15566,15457,15491,15462,15458,15443,1688,1694,1700,1677,1727,1728,792,795,818,825,827,818,15435,15469,15423,15446,15441,null,133832.26121754225,18874.690090894208,70571.756336975843,124923.67299302663,157191.07675149105,23981.20998,132412.11645999999,347273.04585999995,0,139131.76821492397,19142.018232470327,72717.338158368875,127429.04232190868,151640.03256902113,24221.753738999992,131563.98532799998,343904.87675699993,19.510000000000002,17.440000000000001,24475.884212764453,5637.6130000000003,906.08100000000002,null,15320,538,534,521,509,507,508,null,0,0]
[2084,"Avesta",5060083.9000000004,null,22926,22813,22869,22922,22973,23022,21.97,21.96,null,19.510000000000002,17.440000000000001,null,2317,2709,-241.111716182935,40.461032669667475,22932,22753,1305,1861,287,2314,725,4355,1381,288,1258,1810,249,2297,750,4322,1463,292,21467,21582,22022,22781,23161,23256,23256,23323,23178,23067,22925,22932,2466,2560,2604,2585,2554,2601,1311,1315,1342,1348,1318,1305,23348,23185,23100,22929,22926,null,135701.6099935387,19304.057786359252,69204.343081828207,123308.79438829298,152898.61670577643,23661.155699999999,132654.87871999998,337684.48089999997,0,141444.24927089442,19585.941012240251,71302.515101494384,125740.89458135284,150279.94638113776,23980.854914999993,133211.85788699996,336027.90055499994,19.510000000000002,17.440000000000001,28798.522453111556,6360.6859999999997,1497.0050000000001,null,21910,723,704,666,689,709,725,null,0,0]
[2085,"Ludvika",5803919.0999999996,null,26343,26414,26479,26541,26600,26656,22.07,22.06,null,19.510000000000002,17.440000000000001,null,4044,3980,810.78484325910699,711.88531274465367,26353,26402,1508,2262,335,2800,836,4699,1503,369,1420,2315,333,2842,880,4655,1590,348,25639,25712,26030,26362,26933,26992,26992,26946,26898,26604,26497,26353,2890,3026,3095,3091,3105,3135,1691,1692,1654,1636,1571,1508,26976,26921,26666,26498,26343,null,136558.85228447136,19217.2493905056,69421.44120721957,124111.59000808022,147426.40658705722,24263.162559999997,136899.4081,344911.82908,0,142049.29877651104,19491.794836026576,71544.330026309821,126765.96342677517,147274.80812129617,24605.945828999993,136779.65253899997,350041.56662699993,19.510000000000002,17.440000000000001,29413.376418029839,7386.12,1294.0609999999999,null,25400,841,860,866,852,835,836,null,152.97359999999998,0]
[2101,"Ockelbo",1234854,null,5837,5773,5787,5800,5813,5825,22.76,22.76,null,19.309999999999999,17.239999999999998,null,3590,3544,796.74315084822501,923.40206239789313,5821,5758,256,435,47,577,185,1380,289,80,236,427,52,557,174,1362,331,74,5850,5785,5765,5849,5856,5896,5896,5906,5908,5884,5865,5821,554,589,605,601,623,624,288,283,301,293,268,256,5925,5921,5881,5883,5837,null,132467.53296041847,19238.477442264735,72102.184601314337,127977.19364379311,165649.91541911557,23808.1194,143522.57217999999,361449.05549999996,0,137610.48282746517,19508.254169893567,74278.099884190713,130262.90685066722,161609.78100084234,23627.813534999994,140043.20858999997,374112.75860099989,19.309999999999999,17.239999999999998,8402.4743453830033,3878.9059999999999,166.43299999999999,null,5975,171,156,166,179,195,185,null,0,0]
[2104,"Hofors",2127477.6,null,9480,9375,9398,9420,9441,9461,22.86,22.86,null,19.309999999999999,17.239999999999998,null,-238,117,874.11007520704504,627.61572218531182,9472,9374,470,730,111,923,312,1897,545,113,450,695,93,918,303,1898,563,116,9521,9511,9431,9435,9564,9660,9660,9602,9588,9570,9578,9472,981,975,1006,1018,1052,1034,502,506,502,510,499,470,9578,9593,9567,9583,9480,null,132439.98891738683,18416.887403018973,68571.415511762287,121022.26129870622,165586.48338298179,23654.623979999997,136922.26911999998,342699.75323999999,0,138003.46914565121,18684.296818823928,70652.181396036322,123311.21493419656,163515.4377816084,24079.498829999993,137360.09410199997,353859.60531599994,19.309999999999999,17.239999999999998,9686.1264046570868,4345.3969999999999,216.45500000000001,null,10055,329,302,282,277,274,312,null,0,0]
[2121,"Ovanåker",2374095.2999999998,null,11656,11563,11592,11619,11645,11670,21.86,21.86,null,19.309999999999999,17.239999999999998,null,3220,4213,230.89598829683499,143.75510634221337,11622,11525,646,908,138,1157,380,2400,749,157,640,908,117,1167,395,2369,768,165,11392,11354,11432,11469,11631,11609,11609,11684,11670,11672,11711,11622,1194,1231,1276,1286,1298,1295,595,593,602,629,660,646,11649,11672,11677,11721,11656,null,132853.11375628744,18607.955322092166,70681.648903819892,123903.24114113351,148083.33095749596,22670.511499999997,131333.29403999998,347183.77901999996,0,138738.18014343272,18886.587924937085,72838.541414984662,126416.11000624626,148083.50014725034,23021.413046999995,134632.33026299998,347175.70130699989,19.309999999999999,17.239999999999998,13649.666958653919,4496.3720000000003,120.54900000000001,null,11781,394,384,350,342,353,380,null,0,0]
[2132,"Nordanstig",1924313.1,null,9492,9381,9404,9426,9447,9467,22.51,22.51,null,19.309999999999999,17.239999999999998,null,4114,5316,-98.957379903204099,-81.407193502486734,9487,9370,486,779,105,1006,309,1979,523,99,460,768,113,1003,317,1949,562,93,9533,9491,9493,9490,9511,9481,9481,9517,9477,9483,9480,9487,1059,1094,1111,1108,1079,1111,505,517,503,493,507,486,9526,9476,9489,9491,9492,null,132903.9564094941,19342.883126538167,76146.359064199234,133907.61283662502,159455.38372927002,25553.177259999997,150314.47235999999,358429.22361999995,0,138402.31942242495,19622.437807902632,78476.664565906889,136598.52429236475,157545.6177247334,25637.034329999995,149141.29262399997,387058.99367699993,19.309999999999999,17.239999999999998,15023.019702987758,3651.953,218.327,null,9822,274,294,300,325,332,309,null,0,0]
[2161,"Ljusdal",3912382.4,null,18769,18581,18627,18670,18712,18752,22.36,22.36,null,19.309999999999999,17.239999999999998,null,3111,3522,1221.3970440616999,1094.6256550567596,18771,18538,881,1396,200,1836,661,3928,1150,251,855,1341,176,1776,679,3910,1175,263,18880,18931,18949,19027,19067,19028,19028,19033,18949,18867,18804,18771,2122,2129,2103,2080,2034,2036,895,895,921,906,907,881,19023,18936,18883,18821,18769,null,131065.88485088407,18540.749694137394,71936.089451277279,126169.07428734592,155086.28524586232,24311.061839999998,138792.51827999999,353397.62198,0,136743.80616741171,18814.179992187241,74099.181644324402,128558.60042071361,156045.19192042889,24735.740453999995,139157.49006899996,357019.32566699991,19.309999999999999,17.239999999999998,25989.339434904508,8052.4470000000001,911.91399999999999,null,19189,645,647,653,647,663,661,null,461.90639999999996,0]
[2180,"Gävle",24972560.5,null,103409,103581,103836,104077,104310,104531,22.26,22.26,null,19.309999999999999,17.239999999999998,null,-1130,-932,60.169452584313099,274.25387918669639,103493,103532,5724,8330,1160,10791,3582,15686,4983,942,5562,8267,1170,10802,3558,15717,5221,955,96170,97236,98314,98877,99788,100603,100603,101455,102418,102904,103136,103493,11585,11795,11923,11904,12006,11951,5792,5808,5893,5918,5772,5724,101340,102355,102827,103183,103409,null,135861.22279477361,21039.802429402993,68347.236278758486,121600.71271250879,138860.46463922042,23853.841439999997,130596.29829999999,334082.23731999996,0,141609.42340152219,21347.02938221267,70427.659015537283,124078.18669191304,137881.7181032208,24377.507288999994,131402.00163599997,339496.01293499995,19.309999999999999,17.239999999999998,110412.64218220301,16190.493,9710.9439999999995,null,92644,3250,3390,3493,3612,3589,3582,null,0,0]
[2181,"Sandviken",9001506.8000000007,null,39136,38719,38814,38904,38991,39073,21.61,21.61,null,19.309999999999999,17.239999999999998,null,1648,2129,-1224.0661062629499,-913.6058135331823,39098,38628,2072,3199,461,4067,1434,6840,2261,414,1929,3138,439,3973,1392,6752,2387,431,37089,37250,37833,38314,38949,39259,39259,39208,39234,39290,39250,39098,4408,4470,4512,4533,4482,4528,2185,2170,2182,2116,2132,2072,39182,39257,39309,39280,39136,null,136150.88913148033,19887.969648782626,68947.320029568247,123443.91274309649,152390.31701061453,23673.130519999999,131050.25283999999,338780.72123999998,0,141622.70038649309,20171.385025548363,71033.470761468983,125773.19374928683,152633.04090426242,24203.063312999995,130639.84759799996,339253.03739699989,19.309999999999999,17.239999999999998,49249.857935291649,10135.547,2986.165,null,36795,1371,1356,1368,1423,1427,1434,null,0,0]
[2182,"Söderhamn",5353445.7,null,25343,24957,25019,25077,25133,25186,21.66,21.66,null,19.309999999999999,17.239999999999998,null,2518,3312,1413.2624229191999,1154.7058655700312,25258,24858,1259,1984,263,2549,815,5337,1548,313,1210,1889,226,2494,799,5314,1607,313,25223,25442,25456,25785,25992,25782,25782,25721,25643,25492,25446,25258,2669,2689,2754,2771,2809,2812,1378,1326,1368,1326,1279,1259,25717,25686,25582,25467,25343,null,133952.84421190151,18968.411347626479,70281.992994798798,124902.27599921975,147614.36865608065,24186.959159999999,137939.04019999999,354934.75341999996,0,139679.6337912743,19246.138394533606,72408.317214852228,127259.46304664398,147346.06864133209,24504.186842999996,141229.01228399997,358187.47729199991,19.309999999999999,17.239999999999998,35113.186947694783,12748.785,1412.4659999999999,null,26126,806,812,804,808,801,815,null,0,0]
[2183,"Bollnäs",5529481.2000000002,null,26605,26462,26527,26589,26648,26704,21.86,21.86,null,19.309999999999999,17.239999999999998,null,2343,2692,676.97073861672402,571.83211318328995,26624,26414,1446,2106,280,2696,905,5158,1594,342,1364,2072,296,2691,895,5116,1676,337,26158,26141,26394,26594,26929,26918,26918,26991,26888,26809,26753,26624,2963,3005,3015,3007,3005,2976,1466,1472,1491,1529,1467,1446,27021,26889,26811,26744,26605,null,134710.30732399557,19805.703935656085,70989.38747429724,125626.65796446163,151279.14111371592,24374.201799999999,135737.85055999999,349232.56185999996,0,140213.84380416459,20090.109323434328,73157.967532820607,128139.70614164755,149464.16711301683,24759.622664999995,137083.89113999996,352535.70014099992,19.309999999999999,17.239999999999998,34296.379101422346,10233.576999999999,1285.6859999999999,null,26197,844,859,887,906,894,905,null,346.90379999999999,0]
[2184,"Hudiksvall",8621258.6999999993,null,37704,37693,37786,37874,37959,38039,21.61,21.61,null,19.309999999999999,17.239999999999998,null,-310,-204,1976.0960217146501,2100.8292527667154,37688,37645,1813,2918,401,3852,1360,7515,2100,423,1727,2892,417,3812,1361,7453,2222,432,36821,36829,36924,36975,37299,37401,37401,37430,37607,37531,37744,37688,4282,4295,4305,4266,4296,4253,1905,1888,1857,1838,1846,1813,37438,37548,37605,37700,37704,null,132402.89939913171,20435.629505995897,69826.763223840811,122703.4311314791,146552.62274257341,24306.707359999997,136355.0981,347439.60472,0,137820.97984351596,20729.239694043968,71945.191497061533,125163.90161504176,147655.84663857351,24533.260838999995,136963.44172799998,351441.27186299994,19.309999999999999,17.239999999999998,54037.063930722448,14272.593999999999,3029.337,null,36936,1201,1258,1291,1368,1339,1360,null,0,0]
[2260,"Ånge",1993440,null,9169,9103,9125,9146,9166,9185,23.33,23.33,null,21.04,18.970000000000002,null,4735,4506,462.19726346848302,1290.8181233623463,9143,9109,444,608,81,811,306,1925,593,107,433,603,74,786,316,1927,610,108,9639,9548,9484,9493,9495,9480,9480,9411,9316,9226,9233,9143,946,943,916,906,908,892,424,413,416,421,428,444,9391,9336,9268,9254,9169,null,132036.76753210861,18732.046363750127,75983.495832629953,132505.29328854638,172640.67981566073,27560.592539999998,149515.42528,386502.55617999996,0,137719.26775696888,19008.423149744143,78261.233073295007,135109.95042788869,171389.71237837509,27391.857659999994,150673.90755599996,376150.01503499993,21.04,18.970000000000002,4167.6722783168461,2351.2350000000001,1.633,null,10452,315,289,306,313,309,306,null,324,0]
[2262,"Timrå",4108248.8,null,17730,17530,17573,17614,17653,17690,23.19,23.19,null,21.04,18.970000000000002,null,-1758,-1257,-955.72923386516004,-831.9510750929503,17754,17540,899,1419,198,1845,647,3174,922,142,852,1367,177,1804,625,3140,982,152,17997,18062,18025,17987,17992,18030,18030,18060,17979,17963,17923,17754,2136,2122,2085,2067,2073,2043,949,960,955,945,933,899,18030,17958,17973,17921,17730,null,135527.80410460327,20820.89842138407,69633.780211553123,122254.42014386265,145395.83697298961,23733.00462,137945.57191999999,350463.79108,0,141135.15966600113,21121.091994817674,71738.532057161588,124601.85713476468,145984.33833945426,24139.723535999994,136664.39491199996,354406.81945499993,21.04,18.970000000000002,23204.128265983465,5501.7820000000002,1101.777,null,17836,696,688,654,657,616,647,null,0,0]
[2280,"Härnösand",5380829.5999999996,null,24872,24665,24726,24783,24838,24891,23.34,23.34,null,21.04,18.970000000000002,null,1432,1619,2819.6371179418702,2771.2689658221288,24879,24654,1290,1931,248,2613,888,4881,1528,270,1241,1894,268,2553,872,4869,1590,284,24398,24509,24755,25066,25269,25190,25190,25120,25183,25114,25012,24879,2947,2913,2928,2846,2868,2861,1274,1274,1297,1308,1276,1290,25134,25165,25111,24992,24872,null,135935.52814639019,20651.114802957858,69009.940026306736,122914.33120517034,142669.36932910976,23980.121359999997,131802.48926,344570.0024,0,141686.4798740758,20952.550329221358,71101.637196700889,125332.98724648012,140939.31776774142,24496.918343999994,130907.74370399996,351643.7514779999,21.04,18.970000000000002,28289.580638739841,8970.9989999999998,906.52,null,24936,848,839,854,913,924,888,null,0,0]
[2281,"Sundsvall",24607266.5,null,99342,99362,99607,99839,100062,100274,22.59,22.59,null,21.04,18.970000000000002,null,-1311,-1104,151.44737386326599,301.63557085302091,99361,99213,5230,7810,1169,10266,3654,15970,5212,984,5044,7706,1080,10274,3613,15812,5541,1027,96687,96978,97338,97633,98325,98810,98810,98850,99449,99439,99383,99361,11737,11665,11669,11577,11443,11435,5426,5397,5495,5528,5396,5230,98826,99391,99437,99368,99342,null,133133.28946958133,21180.91564109458,68920.75798380858,121347.55710922365,136151.25350586118,23591.48402,129887.60668,336970.34617999999,0,138713.30085101872,21488.62443424615,71015.521087139685,123869.62292129162,136403.49453929503,23896.747997999995,130298.22814499997,342326.57411699992,21.04,18.970000000000002,104306.00438155285,13584.998,8579.8970000000008,null,94590,3088,3260,3463,3592,3652,3654,null,0,0]
[2282,"Kramfors",3722563.2,null,17943,17652,17696,17737,17777,17815,23.14,23.14,null,21.04,18.970000000000002,null,2484,2848,2317.2373914362402,2136.896266653911,17904,17631,798,1220,166,1623,587,3974,1114,250,748,1209,171,1577,555,3953,1136,262,18516,18450,18435,18359,18681,18610,18610,18423,18282,18133,18005,17904,1818,1829,1820,1786,1792,1789,849,886,860,835,808,798,18417,18317,18112,18050,17943,null,133755.19413454327,18960.575931034648,73622.933484729336,129805.02527489966,159205.16311700686,25092.690999999999,141234.29293999998,361788.70493999997,0,139204.98274607857,19232.961382275997,75851.481765976889,132373.5330023439,162586.05416852236,25132.392827999993,139846.95911699996,362283.79565699992,21.04,18.970000000000002,17366.943334437823,5788.2550000000001,270.392,null,19663,610,609,614,656,614,587,null,107.21439999999996,0]
[2283,"Sollefteå",3847445.1,null,18673,18548,18594,18637,18679,18718,23.39,23.39,null,21.04,18.970000000000002,null,6572,7096,1784.0705562247999,1348.310117036227,18667,18523,922,1448,203,1831,582,3983,1299,268,864,1429,190,1840,583,3956,1321,286,19736,19623,19776,19783,19846,19709,19709,19500,19140,18872,18814,18667,2066,2044,2023,2024,2056,2034,1049,1045,1027,973,913,922,19494,19207,18900,18809,18673,null,134413.01445180495,19121.906518139174,73626.502152505054,129922.20424364717,158067.91376675948,25864.522579999997,141284.36945999999,351525.19558,0,139818.65717873294,19394.543829773647,75874.96895677947,132605.71011076722,157494.97313607603,25857.166013999995,141793.87849199996,353889.71766899992,21.04,18.970000000000002,8935.1288397429817,4159.2309999999998,7.7910000000000004,null,20703,672,642,617,575,562,582,null,471.4982,0]
[2284,"Örnsköldsvik",13004443.4,null,55605,55483,55620,55749,55874,55992,22.71,22.71,null,21.04,18.970000000000002,null,974,864,1180.31566079552,1167.8135469013714,55557,55478,2994,4655,672,5972,1934,10228,3147,606,2908,4596,624,6009,1935,10106,3333,581,55008,54986,55248,55576,55964,56139,56139,56089,55998,55807,55823,55557,6414,6503,6605,6616,6634,6644,3245,3200,3189,3118,3073,2994,56084,56006,55862,55829,55605,null,133104.29271229109,21123.96706491246,71296.18614216811,125191.95441198185,148442.57519974114,22071.770499999999,135230.55364,354259.80901999999,0,138749.90137330481,21432.453127256198,73468.742481122623,127744.13772137612,146374.36638314431,22281.064505999995,135170.19918899998,355195.97077499994,21.04,18.970000000000002,67380.341896847502,13245.873,3187.04,null,55271,1850,1802,1852,1900,1903,1934,null,0,0]
[2303,"Ragunda",1032464.2,null,5188,5135,5148,5160,5172,5183,23.22,23.22,null,20.170000000000002,18.100000000000001,null,11365,11888,-5578.0720454617604,-5526.414417974157,5174,5135,266,396,39,527,150,1070,372,62,239,395,61,506,156,1074,375,62,5466,5458,5440,5387,5415,5444,5444,5343,5284,5208,5210,5174,574,563,557,556,571,566,267,268,259,244,256,266,5354,5285,5209,5221,5188,null,134231.87052370765,18347.499324709202,78619.906054258303,138663.95641374108,179647.56008365777,27382.058859999997,159199.78879999998,395683.97725999996,0,139204.91080308301,18599.504603553538,81005.14661741184,141181.00194577355,176136.12440613363,28098.978776999993,159201.93359699997,405199.09046699991,20.170000000000002,18.100000000000001,2182.0424443219722,1473.885,0,null,5767,175,171,157,166,150,150,null,284,0]
[2305,"Bräcke",1249371.6000000001,null,6155,6091,6106,6120,6134,6147,23.39,23.39,null,20.170000000000002,18.100000000000001,null,9097,9841,-438.21543923593401,-1057.8764040263013,6162,6099,280,452,71,565,207,1379,354,84,269,449,70,571,193,1364,408,85,6655,6559,6463,6455,6492,6501,6501,6376,6298,6181,6175,6162,669,647,611,607,626,636,316,312,315,321,303,280,6369,6319,6207,6163,6155,null,133545.45503942049,19159.329433043116,79982.616743540304,141313.34238794495,165823.46653514798,27268.842379999998,154937.84149999998,397577.08743999997,0,139210.31178878859,19439.681120269073,82436.026857027275,144577.62831272854,166796.46881314405,27313.980884999994,147042.77312699996,391457.47392899991,20.170000000000002,18.100000000000001,4468.3671733646688,2403.857,14.07,null,7125,244,214,207,203,208,207,null,1318.4594,0]
[2309,"Krokom",3413321.1,null,15481,15604,15642,15678,15713,15746,22.17,22.17,null,20.170000000000002,18.100000000000001,null,5594,5689,801.223789378373,953.30610841784528,15532,15595,984,1541,218,2025,654,2598,654,120,938,1506,206,2026,669,2589,725,112,14590,14643,14648,14785,14843,14925,14925,14858,14966,15054,15352,15532,2197,2186,2220,2196,2247,2243,952,970,961,951,968,984,14868,14951,15027,15347,15481,null,137802.83943846039,22295.998999936583,74648.44638631698,131200.36501049917,153947.79389831147,24343.720439999997,143768.60029999999,364294.70817999996,0,143433.15212045066,22615.632519372637,76917.673078690757,133792.92019592968,156252.94966248606,24782.466518999994,141425.26175699997,361930.75427699991,20.170000000000002,18.100000000000001,24233.377323897272,6455.5420000000004,1202.329,null,14298,513,526,556,581,605,654,null,770,0]
[2313,"Strömsund",2307948.2999999998,null,11391,11139,11166,11192,11217,11241,23.22,23.22,null,20.170000000000002,18.100000000000001,null,9641,10109,1039.7954926668201,1290.3399405323635,11397,11113,588,875,111,1086,330,2511,779,175,500,850,125,1072,298,2503,812,169,12138,11984,11873,11712,11809,11791,11791,11703,11605,11488,11473,11397,1137,1144,1154,1159,1173,1197,609,599,608,601,593,588,11685,11643,11495,11492,11391,null,135133.13138004066,19061.175172801064,77728.521902126449,137269.9817180383,170958.4574021147,26687.519299999996,152474.29444,387322.28703999997,0,139738.35622736395,19313.538498194728,80113.400895859362,139863.47314677856,172011.17583109057,27543.457781999994,155463.84839699997,392971.39843499992,20.170000000000002,18.100000000000001,8961.4631565039472,3102.7559999999999,10.037000000000001,null,12679,355,340,342,348,360,330,null,1765.327,0]
[2321,"Åre",2763518.8,null,12277,12376,12407,12436,12464,12490,22.22,22.22,null,20.170000000000002,18.100000000000001,null,-509,-1130,-2851.9428898278502,-3111.0348121374677,12330,12464,735,1031,153,1336,385,1660,442,85,719,1029,158,1339,401,1679,472,88,10406,10420,10555,10677,11088,11268,11268,11529,11727,12049,12271,12330,1339,1385,1405,1456,1458,1489,598,659,714,747,760,735,11470,11626,11981,12194,12277,null,134943.11097849332,21033.790930411349,76454.916270518806,134360.85274901544,163981.73188787856,25884.117739999998,145243.68039999998,380598.96991999994,0,140615.96058002792,21339.916860152895,78776.836118706997,136912.24400421872,160114.02643082532,25462.590353999993,142502.03796599997,369698.70299399993,20.170000000000002,18.100000000000001,44128.356441946678,8913.2464999999993,2563.0839999999998,null,10108,373,377,372,371,368,385,null,1512,0]
[2326,"Berg",1430492,null,7154,7114,7132,7149,7165,7180,22.52,22.52,null,20.170000000000002,18.100000000000001,null,9687,9740,1810.38146138723,1373.2896064377446,7176,7140,431,522,73,677,250,1546,465,104,405,523,78,667,247,1540,489,90,7215,7160,7067,7032,7081,7122,7122,7097,7061,7120,7135,7176,764,767,742,750,760,750,362,373,384,387,409,431,7095,7040,7113,7119,7154,null,135410.83061727681,19581.782394860427,79088.029704235669,139443.63831390865,171844.23395227053,26514.42872,152910.83106,365629.35629999998,0,140902.24773358234,19862.353303784366,81489.774722335613,142015.64092434975,172157.61120335417,27735.553826999992,155138.84265599996,391111.7010479999,20.170000000000002,18.100000000000001,18074.22720075199,6186.6869999999999,592.06600000000003,null,7593,230,227,221,245,245,250,null,1389,0]
[2361,"Härjedalen",2202158,null,10196,10136,10161,10185,10208,10230,22.47,22.47,null,20.170000000000002,18.100000000000001,null,3155,2927,459.24783206943698,151.54491816897826,10185,10145,429,666,87,857,290,2189,672,140,408,666,89,869,276,2164,714,124,10246,10281,10224,10262,10200,10154,10154,10147,10090,10070,10114,10185,965,970,945,918,917,944,421,419,415,422,415,429,10133,10089,10045,10065,10196,null,130608.99380406374,18648.092277393331,80111.122812992544,140187.56815785202,169523.52518265392,26346.781239999997,150597.51355999999,377817.54582,0,135955.04083877263,18916.51749769452,82568.180539305322,143331.48925686427,169597.77228275969,27026.355995999995,149823.49317299997,378659.7239039999,20.170000000000002,18.100000000000001,46058.671284399825,13228.212,2386.6179999999999,null,10702,306,294,299,315,309,290,null,2104,0]
[2380,"Östersund",14997082.800000001,null,64642,64871,65031,65182,65328,65466,22.02,22.02,null,20.170000000000002,18.100000000000001,null,-1962,-1672,6621.05486663992,6946.090972706018,64714,64881,3468,5244,740,6818,2194,10481,3151,625,3318,5262,764,6830,2260,10432,3350,618,59485,59956,60495,61066,61745,62601,62601,63227,63779,63985,64324,64714,7053,7203,7290,7440,7522,7558,3619,3684,3701,3626,3498,3468,63072,63744,63987,64313,64642,null,134757.05461091732,21711.116766132,69325.58215938686,121737.81089150846,135508.6150781092,25016.487599999997,132034.36531999998,336617.63329999999,0,140292.9341388125,22023.987569125486,71435.908943206494,124295.35110000076,137100.3801895582,25426.247858999996,132668.79717599996,346373.05134599993,20.170000000000002,18.100000000000001,56353.945835892242,7958.8389999999999,5342.1490000000003,null,58684,1829,1877,1990,2069,2143,2194,null,341,0]
[2401,"Nordmaling",1519682.7,null,7072,7050,7067,7083,7099,7114,23.25,23.25,null,20.55,18.48,null,4911,4048,931.47259486084602,1012.8054801238268,7066,7033,379,519,85,664,253,1464,470,92,374,511,71,677,230,1454,479,78,7039,7006,7085,7060,7132,7103,7103,7118,7143,7108,7100,7066,768,774,755,754,734,749,375,368,369,353,386,379,7090,7150,7099,7104,7072,null,133233.17603906954,19502.959801820281,73037.089064501444,127739.85719752088,167046.98186893677,22424.483379999998,135958.84041999999,362635.65129999997,0,139066.34855928231,19792.962275046779,75270.671651899742,130479.39195135265,169809.07734490323,22830.355358999994,138285.27018899997,356039.11665899993,20.55,18.48,11996.049547788287,3791.8180000000002,375.97399999999999,null,7389,272,258,277,258,258,253,null,433,0]
[2403,"Bjurholm",471523.9,null,2375,2351,2357,2362,2367,2372,23.15,23.15,null,20.55,18.48,null,10819,11223,-4850.8382349819603,-5170.0366445531781,2372,2348,132,181,33,221,71,481,164,49,130,183,31,225,74,472,165,48,2421,2436,2451,2453,2454,2451,2451,2450,2408,2387,2395,2372,276,278,257,245,242,254,117,114,108,121,143,132,2475,2415,2384,2393,2375,null,139857.60903267338,19207.020645402688,79947.23115755539,140290.80931182153,175863.57760894965,23356.342099999998,147221.70293999999,378458.74299999996,0,145999.8737542399,19493.701862534679,82402.209703434404,142916.8027520875,171532.23688681721,24447.077207999995,142633.90930499998,374295.50943299988,20.55,18.48,1633.1892860949663,539.28,0,null,2552,94,77,86,80,81,71,null,432,0]
[2404,"Vindeln",1136839.7,null,5508,5480,5494,5507,5519,5531,23.6,23.35,null,20.55,18.48,null,9205,8781,926.03444405025505,750.85589106343377,5504,5461,315,454,67,602,168,1129,335,83,309,435,52,603,166,1121,328,82,5359,5344,5383,5371,5413,5412,5412,5436,5423,5485,5550,5504,615,642,634,631,666,669,299,283,285,296,315,315,5442,5416,5478,5543,5508,null,135496.83065926284,20224.834767534438,78050.560562439743,137496.57867591127,181401.32683101986,23874.52522,143574.82593999998,386981.54897999996,0,141374.68457621688,20523.431490564231,80423.780182244416,140288.26150996485,174557.5714088449,24307.937369999996,145259.91415799997,386973.84840299992,20.55,18.48,4921.036873548137,2703.1790000000001,66.968000000000004,null,5653,172,172,181,190,166,168,null,385,0]
[2409,"Robertsfors",1445853.2,null,6757,6746,6763,6779,6794,6808,23.15,23.15,null,20.55,18.48,null,4763,4960,-1144.9516836733101,-1416.2560555918917,6759,6740,356,557,75,731,225,1397,378,80,344,555,70,723,248,1413,401,68,6717,6738,6724,6771,6784,6784,6784,6762,6747,6748,6786,6759,755,763,757,777,792,806,389,368,382,390,371,356,6779,6754,6759,6772,6757,null,133955.04077378314,20135.820897826743,74147.829720384092,130400.58795783948,157165.98171265866,22502.864019999997,147940.19214,376241.22405999998,0,139608.07016196137,20429.537035084853,76394.995674716803,132926.36495984328,156521.75569873501,22656.949739999996,147666.82568399995,386791.09757099993,20.55,18.48,10862.237264692947,3909.0050000000001,351.92200000000003,null,6933,219,215,218,204,218,225,null,382,0]
[2417,"Norsjö",834050.2,null,3960,3917,3927,3936,3945,3953,23.35,23.35,null,20.55,18.48,null,8299,9571,2422.7897316721801,1436.4129225204406,3947,3924,191,311,48,415,130,851,250,47,195,310,35,416,133,862,270,50,4172,4175,4180,4176,4125,4086,4086,4094,3986,3945,3971,3947,463,454,465,454,461,463,225,219,188,187,188,191,4097,3995,3946,3963,3960,null,133142.25836355565,18979.994732479299,78500.207646763098,138131.60033071018,171371.25192766503,23798.321819999997,149200.81409999999,387338.61633999995,0,139360.12226316042,19271.097000935824,80882.457383978908,141198.25337763134,170447.62525265713,23239.468016999996,144596.40403499996,376512.40162799991,20.55,18.48,1292.128907060287,920.005,0,null,4400,148,145,131,132,125,130,null,1367,0]
[2418,"Malå",659076.1,null,3039,3003,3010,3017,3024,3030,23.35,23.35,null,20.55,18.48,null,9825,9757,-2795.2411607923,-2552.7801552466171,3033,2990,159,253,39,318,102,634,189,41,150,239,30,321,94,631,199,42,3196,3155,3115,3109,3100,3133,3133,3122,3068,3024,3034,3033,359,360,344,327,341,357,167,157,158,152,160,159,3109,3078,3026,3039,3039,null,134406.90510592688,19038.010660189215,76367.970963751388,134902.32569183994,183788.1677872983,25039.348619999997,147328.38769999999,378837.58275999996,0,139940.03537398574,19311.615541214887,78700.048147181704,137863.95160769968,186595.46691122945,25171.850393999994,141664.08386699998,361247.51537099993,20.55,18.48,908.93828912249865,371.733,0,null,3334,110,123,120,120,101,102,null,2023,0]
[2421,"Storuman",1201403.5,null,5726,5634,5648,5661,5674,5686,23.1,23.1,null,20.55,18.48,null,8581,9740,-910.88314419006997,-1018.4813198756246,5747,5621,272,402,57,550,143,1239,385,91,246,397,60,547,164,1226,403,80,6006,5954,5955,5943,5899,5902,5902,5912,5852,5826,5808,5747,569,600,586,598,608,607,269,272,289,291,282,272,5895,5863,5832,5805,5726,null,135093.16377186272,19913.19428178982,80633.079260177794,141386.53589562609,162931.51062148614,26698.405499999997,155518.07595999999,369559.2745,0,140288.54305657069,20191.734447606643,83106.720449061293,144413.01611540894,159809.89616532676,26868.525731999995,160453.15378199995,379684.5822629999,20.55,18.48,17280.674147505066,4313.116,641.44200000000001,null,6391,189,177,157,145,145,143,null,3152.6805999999997,0]
[2422,"Sorsele",500307.8,null,2436,2397,2403,2409,2414,2419,23.6,23.6,null,20.55,18.48,null,12913,13354,-1572.0734072069699,-1245.8622898706553,2436,2387,129,179,28,214,61,509,192,36,130,171,23,222,55,513,189,30,2673,2595,2565,2516,2535,2516,2516,2522,2489,2442,2460,2436,229,237,233,237,241,242,133,129,127,124,129,129,2533,2495,2444,2458,2436,null,137142.75056032799,18484.420424432927,87024.542734461458,152597.540893417,162974.53605449467,28441.286119999997,153498.68586,391603.82949999999,0,143478.12205078432,18767.338144644167,89717.647850948051,156221.79958088713,166665.69857908474,29819.536325999994,157066.03324799996,403062.15176099993,20.55,18.48,2139.9557168348988,1132.348,12.118,null,2829,117,89,74,57,68,61,null,2236,0]
[2425,"Dorotea",502358.9,null,2420,2349,2355,2360,2365,2370,23.8,23.8,null,20.55,18.48,null,14493,15808,-885.02051821468001,-635.2426196869601,2413,2339,102,179,28,234,75,571,176,48,105,153,12,231,66,572,188,44,2794,2757,2757,2740,2719,2646,2646,2568,2551,2498,2459,2413,266,256,266,267,266,262,123,108,101,101,100,102,2584,2549,2505,2449,2420,null,128206.40412213551,18045.41226950601,78729.576257690438,138407.28332883058,159190.9890071853,28883.265839999996,161505.48595999999,371534.03117999999,0,134635.47669203655,18329.22030587112,81107.900607081872,140595.59291348993,157619.72040029225,28594.275065999995,163816.39210499995,397548.4760909999,20.55,18.48,3102.3806331173082,1067.5840000000001,97.475999999999999,null,3005,81,86,74,64,62,75,null,2165.0198,0]
[2460,"Vännäs",2008586.6,null,8985,9041,9063,9084,9104,9123,23.35,23.35,null,20.55,18.48,null,1688,1286,4437.8617833882699,4530.7273699836032,8963,9059,581,851,129,1041,331,1355,469,104,567,869,122,1096,319,1347,490,89,8522,8583,8616,8593,8695,8776,8776,8785,8872,8997,9054,8963,1124,1091,1113,1139,1153,1170,564,566,588,601,614,581,8774,8819,8980,9040,8985,null,137039.58334620789,21761.58161997181,70589.768757358659,123726.92589119347,163322.23224202282,21031.049779999998,126506.35295999999,340149.11657999997,0,142784.93088788178,22078.320749250743,72766.027894045779,126493.61129923449,161072.90529483912,21126.411521999995,125390.95296299997,330542.26052399992,20.55,18.48,13043.394155073896,2341.0619999999999,886.32799999999997,null,8346,323,347,339,351,321,331,null,499.13479999999998,0]
[2462,"Vilhelmina",1298791.8999999999,null,6405,6281,6296,6311,6325,6338,23.4,23.4,null,20.55,18.48,null,9905,10552,3779.54720253811,2803.8459453079295,6393,6263,279,459,67,619,218,1317,396,83,292,436,46,611,217,1316,396,87,6941,6887,6848,6829,6805,6787,6787,6752,6668,6539,6485,6393,776,760,716,696,682,686,339,313,304,298,301,279,6758,6670,6549,6488,6405,null,132038.49453202568,18609.88590993662,78241.557460701573,137402.69914453587,178396.80036986512,26629.822439999996,160831.63017999998,380558.69097999996,0,138702.70518482346,18906.345762607292,80612.728278742652,140181.54548973354,174652.45723285503,26671.237901999993,158149.03959899995,396837.20154599991,20.55,18.48,10273.015928308825,3638.9740000000002,144.142,null,7246,261,257,266,243,238,218,null,2382.4072000000001,0]
[2463,"Åsele",559413,null,2781,2734,2741,2747,2753,2759,23.6,23.6,null,20.55,18.48,null,8551,10583,1808.0983015136001,922.75364564777647,2782,2718,130,178,28,242,84,643,199,42,124,191,33,235,92,619,204,39,2958,2875,2838,2832,2875,2809,2809,2819,2794,2805,2807,2782,275,271,267,273,271,270,108,126,133,140,130,130,2817,2787,2797,2817,2781,null,135262.64087432096,19009.535075699652,76452.960025482491,134442.35221325335,163808.00362704525,28218.119019999998,147491.6807,379463.53925999999,0,141100.5680101965,19292.236171703975,78785.822065144064,137249.86825884564,163341.74395956512,29133.182348999992,158461.58505599995,389733.80130899989,20.55,18.48,1228.9772556382538,404.62599999999998,0,null,3273,108,99,99,96,89,84,null,2032,0]
[2480,"Umeå",32045397.399999999,null,132175,133112,133440,133750,134049,134332,22.8,22.8,null,20.55,18.48,null,-6449,-6396,1638.80210814679,1658.7734663754045,132235,133091,7365,10545,1510,13408,4102,17091,4892,945,7194,10513,1497,13548,4162,17182,5291,937,117294,118349,119613,120777,122892,125080,125080,127119,128901,130224,130997,132235,13722,14166,14489,14693,14841,14918,7459,7534,7531,7546,7482,7365,126898,128807,130248,131064,132175,null,135042.20401010636,22775.210374916973,68290.166463719579,119930.95619187343,132482.23043777436,22038.023279999998,126927.64889999999,325451.65795999998,0,140742.07767087463,23107.294349105385,70370.233734371024,122415.10708680221,132041.34143663716,22323.637142999996,126600.63886799997,331505.85581999994,20.55,18.48,122734.646230504,10713.076999999999,12840.941000000001,null,111726,3592,3602,3725,3858,3973,4102,null,0,0]
[2481,"Lycksele",2697892.7,null,12256,12204,12234,12262,12289,12315,23.05,23.05,null,20.55,18.48,null,4325,5441,5101.4095324471,5423.3831547402397,12243,12213,690,1035,167,1327,397,2182,708,118,667,1053,152,1345,426,2171,725,138,12351,12270,12208,12177,12187,12257,12257,12228,12245,12324,12264,12243,1367,1371,1420,1438,1471,1494,698,736,737,754,726,690,12237,12260,12327,12278,12256,null,134685.93718829611,19903.911965042716,72598.491844414661,128242.18537275701,164454.65534073106,24943.550059999998,146737.26703999998,373933.34965999995,0,140372.61852632664,20194.899908741576,74816.307034757236,130831.53121860343,163511.75630875176,25009.866701999996,145762.47894599996,375370.20892799989,20.55,18.48,10442.173097146146,3680.6390000000001,228.69300000000001,null,12541,415,412,387,361,350,397,null,1792,0]
[2482,"Skellefteå",18303993.399999999,null,74241,76219,76407,76585,76756,76918,22.6,22.6,null,20.55,18.48,null,-1456,-2120,2414.5526273077799,2514.4822177119249,74402,76542,3974,5898,857,7552,2521,12932,4069,782,3984,6023,882,7742,2504,12867,4229,797,71774,71988,72024,72031,72266,72723,72723,72467,72589,72840,73393,74402,8145,8082,8176,8221,8267,8409,3947,3996,3921,3890,3933,3974,72466,72563,72846,73320,74241,null,133366.68516405433,21247.539889122541,70459.32857730065,123674.00427534399,142532.16238663005,21388.117139999998,132358.77408,346476.17601999996,0,139040.69840495719,21558.579800532709,72600.09025861205,126404.1344334147,142011.12796254747,21527.217323999994,133155.78660899997,340039.07364599995,20.55,18.48,93748.849856917528,28086.652999999998,6242.2690000000002,null,72042,2409,2441,2459,2503,2505,2521,null,121,0]
[2505,"Arvidsjaur",1396027.1,null,6124,6078,6093,6107,6121,6134,22.8,22.8,null,20.45,18.38,null,7070,6067,1497.36983462031,876.31643652690218,6111,6113,308,444,55,569,178,1194,446,76,283,457,70,554,186,1205,450,77,6467,6471,6484,6471,6442,6440,6440,6334,6220,6145,6143,6111,624,632,621,616,631,624,337,329,325,313,307,308,6329,6244,6155,6145,6124,null,131792.32219134783,18895.766934463372,72670.652531838205,126884.99814228027,166419.80212199999,26633.088299999999,151658.91806,363189.75887999998,0,136810.66953499432,19159.30287250306,74869.420329954111,129234.86101476623,162802.05158668832,26331.695162999993,153377.78918399996,358149.05808299989,20.45,18.38,6439.696668045558,3295.413,55.140999999999998,null,6742,216,185,175,175,184,178,null,2484.0243999999998,0]
[2506,"Arjeplog",618013,null,2678,2618,2624,2630,2636,2642,23.5,23.5,null,20.45,18.38,null,11443,12261,-465.54123728386202,-314.47424711212625,2667,2609,118,176,26,220,72,571,188,52,111,180,25,221,74,559,195,55,3054,2980,2907,2887,2876,2821,2821,2794,2785,2718,2707,2667,259,264,263,255,250,246,132,124,116,121,129,118,2804,2799,2712,2707,2678,null,129137.4290698081,19477.82027385326,81416.536937301513,141297.0026121409,167042.95971460352,29363.347259999999,158896.06381999998,389359.09505999996,0,134527.34871566336,19762.055201555231,83919.829263421503,144230.2590133138,166002.12825607188,28986.774011999994,159533.16947999995,385605.29387699993,20.45,18.38,6749.5917792341843,2379.29,78.421999999999997,null,3092,77,83,84,86,69,72,null,2348,0]
[2510,"Jokkmokk",1109042.7,null,4752,4747,4759,4770,4781,4791,22.95,22.95,null,20.45,18.38,null,5740,5736,-1901.6550378126401,-1904.3719946303672,4760,4728,203,324,41,405,118,1038,321,64,206,322,41,411,112,1044,323,65,5086,5066,5086,5072,5105,5081,5081,5001,4923,4851,4780,4760,452,440,431,438,426,446,243,238,224,209,203,203,4980,4926,4856,4773,4752,null,132383.65486969348,19639.538504138276,77083.789986889751,135525.33104934427,157618.54914348625,26985.801179999999,147540.66859999998,384040.09774,0,138593.0963607833,19941.461273435365,79450.759609235494,138027.02587328924,161258.34942315312,26815.569524999995,147006.43063199997,380916.07366499992,20.45,18.38,4532.3844199761361,1917.0809999999999,21.376999999999999,null,5424,150,135,125,128,132,118,null,4364.0418,0]
[2513,"Överkalix",686907.3,null,3163,3172,3180,3187,3194,3201,22.8,22.8,null,20.45,18.38,null,10628,10597,1367.28524728504,1233.4632423874446,3160,3162,126,172,26,218,78,797,270,59,121,182,29,238,69,805,261,61,3497,3436,3409,3395,3378,3367,3367,3302,3315,3289,3252,3160,278,252,266,255,256,244,124,127,134,143,135,126,3302,3311,3297,3269,3163,null,131890.2433642731,18195.22570063196,76142.829928174571,133024.64551749045,191919.98710027969,26440.402559999999,155895.82709999999,387651.05027999997,0,137367.89989922239,18460.53161477884,78570.885742283484,136745.05474252137,190500.3820066512,26573.632343999994,158270.52736799995,394303.61046599993,20.45,18.38,1808.8619968747989,516.26400000000001,6.7000000000000004E-2,null,3817,106,104,101,95,81,78,null,3359.6008000000002,0]
[2514,"Kalix",3624827.1,null,15734,15588,15626,15662,15697,15730,22.55,22.55,null,20.45,18.38,null,2093,2395,398.99897128082398,266.13108799595557,15729,15547,728,1054,128,1402,520,3315,1115,207,704,1047,153,1385,491,3235,1159,212,16518,16387,16307,16248,16223,16169,16169,16058,15886,15812,15768,15729,1605,1588,1552,1530,1550,1530,695,720,706,719,714,728,16065,15915,15791,15789,15734,null,130655.39771066616,19975.203238082799,71160.245450763396,124111.41028907991,160168.63429838809,23061.326079999999,138057.69978,345349.45431999996,0,136281.39614945784,20269.875577545667,73334.11326860165,126789.47639183082,161560.64262458071,23364.070856999995,139106.61057599998,341480.31316199992,20.45,18.38,15675.470532357615,7456.2629999999999,86.257000000000005,null,17276,549,516,507,486,503,520,null,3017.7231999999999,0]
[2518,"Övertorneå",876575.1,null,4135,4088,4098,4108,4117,4126,21.75,21.75,null,20.45,18.38,null,9048,10389,2860.11829255476,2874.4815761656146,4119,4088,157,244,34,319,110,1168,343,69,160,229,32,316,110,1135,359,70,4772,4709,4711,4603,4534,4461,4461,4410,4299,4217,4211,4119,387,400,365,376,359,353,157,152,161,148,162,157,4409,4308,4216,4203,4135,null,130009.21569902085,18250.174914299339,77197.763904539432,135387.13142936048,162621.69529998431,25331.098779999997,144409.79747999998,356285.73083999997,0,136234.676620543,18533.428169460323,79538.470514810062,137940.7080173475,176362.55338590272,25588.231550999993,146537.09326799997,371890.6746209999,20.45,18.38,2110.9672038492849,543.995,2.1999999999999999E-2,null,5090,182,162,138,115,118,110,null,4679.4814000000006,0]
[2521,"Pajala",1299688.7,null,5900,5871,5885,5899,5912,5924,23.4,23.4,null,20.45,18.38,null,13194,13911,146.87802468287001,16.044253159467189,5883,5871,270,401,56,514,182,1499,514,75,265,423,61,539,165,1522,507,87,6279,6299,6303,6193,6116,6101,6101,6039,6052,5966,5973,5883,601,599,609,582,582,570,283,295,286,270,271,270,6027,6066,5974,5981,5900,null,131595.58764455086,18236.347213435922,80120.28088513136,140022.52670803561,163820.73300938928,29765.048039999998,170515.99369999999,415659.06563999999,0,137340.91506668733,18508.542312105426,82612.257892351903,143149.16783938379,165350.90911619601,29600.442998999992,166293.91190699997,425518.69859999989,20.45,18.38,4925.2987106682122,1817.876,18.012,null,6521,209,202,182,195,179,182,null,4450.9423999999999,0]
[2523,"Gällivare",5017108.5999999996,null,17433,17338,17381,17421,17460,17497,22.55,22.55,null,20.45,18.38,null,1564,1939,688.32660590809201,705.64392362338367,17420,17330,918,1272,189,1588,502,3124,1112,221,879,1314,199,1610,498,3108,1104,226,18307,18339,18231,18123,17956,17825,17825,17630,17529,17462,17449,17420,1622,1663,1706,1707,1778,1777,926,939,937,920,906,918,17654,17540,17472,17452,17433,null,131606.7835990029,18871.040868272499,71002.478244382582,124264.18000590136,153076.91520292035,26031.081439999998,141922.30077999999,351339.04155999998,0,137105.65987116544,19146.150894018036,73183.551016670288,126836.22741182495,154245.67121593651,26520.676136999995,143531.04975299997,350782.9535249999,20.45,18.38,21851.15140294798,2570.5639999999999,1487.095,null,18862,531,493,452,478,472,502,null,4941.5303999999996,0]
[2560,"Älvsbyn",1759526.6,null,7936,7812,7831,7849,7867,7884,22.45,22.45,null,20.45,18.38,null,2295,2555,1817.5042655054001,2330.1720576605194,7911,7783,389,598,87,748,261,1516,481,111,396,579,69,762,225,1516,523,108,8200,8168,8171,8183,8193,8274,8274,8140,8066,8054,8009,7911,906,904,868,834,829,835,420,391,392,410,391,389,8157,8070,8042,8034,7936,null,131153.78090958824,18287.1447635968,71552.398382337007,125676.38702220006,160829.29683478558,22728.208359999997,137027.86525999999,351401.09289999999,0,137345.62130635197,18569.453376207253,73749.630577265023,128381.06307903629,158461.83963289269,22881.234851999994,135317.64588299996,343647.36422099994,20.45,18.38,5807.6003605485712,2175.0410000000002,26.358000000000001,null,8571,325,278,280,292,292,261,null,2150.9389999999999,0]
[2580,"Luleå",20371679,null,79249,79400,79596,79781,79959,80128,22.5,22.5,null,20.45,18.38,null,-4591,-4589,983.35637846954796,704.5247429868441,79244,79352,3984,5879,842,7638,2530,12094,3938,740,3857,5812,783,7612,2615,12059,4151,720,74905,75383,75966,76088,76770,77470,77470,77832,78105,78549,78867,79244,8216,8280,8366,8451,8442,8480,4017,4045,4013,3959,3985,3984,77817,78120,78604,78870,79249,null,134795.00682129891,22272.735803349176,69211.537997364125,121111.47627132338,136119.31691751909,22683.574939999999,126958.13025999999,337883.69835999998,0,140451.44928093508,22596.460587339014,71308.042704390231,123573.74288797505,137606.76894002387,23134.593959999995,127575.65609099997,340365.11774399993,20.45,18.38,84079.215940607231,10243.308000000001,8095.5469999999996,null,73180,2361,2342,2361,2344,2437,2530,null,1757.924,0]
[2581,"Piteå",10417323,null,42330,42362,42466,42565,42660,42750,22.25,22.25,null,20.45,18.38,null,-3810,-3496,688.18523305576696,623.41863806813581,42362,42344,2177,3314,468,4228,1444,7750,2182,389,2116,3334,469,4277,1405,7724,2313,397,41078,41278,41508,41548,41904,42184,42184,42116,42281,42226,42323,42362,4578,4548,4626,4645,4691,4696,2314,2319,2229,2213,2175,2177,42099,42296,42186,42336,42330,null,132222.84568409604,21136.937845066561,69655.200990863712,121508.4607865252,144653.87089007947,21614.550099999997,133428.88754,350409.36007999995,0,137836.19067390458,21446.408537319541,71784.92458737969,124035.2341163332,145187.58125513711,21837.686066999995,132907.61928599997,354058.9698599999,20.45,18.38,61288.286509023252,14446.63,3765.5709999999999,null,40976,1465,1465,1468,1470,1454,1444,null,921.32539999999995,0]
[2582,"Boden",6758393.4000000004,null,28056,27960,28029,28094,28157,28217,22.6,22.6,null,20.45,18.38,null,-2054,-1630,3052.0436016219901,3031.9409427323744,28048,27943,1398,1997,296,2581,905,5347,1573,322,1363,2026,294,2596,887,5303,1647,329,27598,27838,27887,27913,28042,28181,28181,28064,28080,28060,28160,28048,2894,2869,2873,2837,2880,2877,1408,1418,1430,1450,1412,1398,28051,28080,28083,28168,28056,null,133194.96751140949,21504.792094076704,70465.797277871621,123249.34941982447,144691.39007716003,23170.18808,133195.92285999999,346237.76823999995,0,138921.86402340725,21822.020805460939,72617.686741970057,125902.14487764945,145568.35551388326,23558.243615999996,134397.66158099996,349130.92753799993,20.45,18.38,34147.946268815671,7675.143,1943.107,null,27816,944,940,887,925,897,905,null,2315.232,0]
[2583,"Haparanda",1910181,null,9341,9195,9218,9239,9260,9280,22.5,22.5,null,20.45,18.38,null,5201,5937,2848.9106932603399,2633.0061142483455,9340,9177,394,741,90,980,306,2247,600,96,373,696,82,955,321,2225,624,99,9904,9886,9776,9831,9864,9805,9805,9785,9685,9601,9496,9340,1061,1085,1094,1113,1098,1070,478,485,458,443,415,394,9763,9678,9595,9502,9341,null,132017.89968669086,18491.983306980463,70269.312871223563,125742.74427227951,164930.79435502103,26758.279599999998,140306.78869999998,366469.77093999996,0,137512.31924697183,18758.206149891023,72396.969674021544,128025.26578648786,162146.16993847652,27472.849505999995,143543.51003699997,360784.40814899991,20.45,18.38,6615.3365766475144,1152.886,58.539000000000001,null,10219,332,330,311,289,315,306,null,3067.3825999999999,0]
[2584,"Kiruna",6442682.9000000004,null,22454,22424,22479,22531,22581,22629,23.05,23.05,null,20.45,18.38,null,-789,-639,-147.28280883229499,-279.94509691702387,22423,22433,1173,1773,277,2180,751,3401,1227,187,1182,1703,208,2229,711,3388,1246,200,22972,23196,23241,23178,23167,23116,23116,22992,22867,22664,22555,22423,2457,2472,2505,2487,2489,2457,1364,1293,1287,1267,1231,1173,22967,22877,22666,22523,22454,null,132871.21244252264,20077.120919950336,70984.371215679028,123982.88965596995,144848.29517911476,24990.360719999997,141673.0068,356488.21415999997,0,138835.78404825236,20378.072413972706,73147.549681277203,126702.53502827353,145963.10888322629,25263.225809999993,142608.98873699998,361278.66608099989,20.45,18.38,33355.767017774524,4834.72,2209.317,null,23088,772,737,726,691,711,751,null,4745.6098000000002,0]
[]
[null,null,null,null,null,null,null,null,null,null,null,null,null,null,null,null,null,null,null,null,null,null,null,null,null,null,null,null,null,null,null,null,null,null,null,null,null,null,null,null,null,null,null,null,null,null,null,null,null,null,{"$f":"SUM(AY3:AY292)","v":1181186},{"$f":"SUM(AZ3:AZ292)","v":1207133},1225478,1237497,1247539,1254735,607451,610134,610904,604630,599212,592729,null,null,null,{"$f":"SUM(BN3:BN292)","v":10443100},null,null,null,null,null,null,null,null,null,null,null,null,null,null,null,null,null,null,null,null,null,null,null,null,null,null,{"$f":"SUM(CO3:CO292)","v":325507},332330,339069,347667,353807,361331,0]

{"sheet":"Diagram","index":3,"n_rows":0,"n_cols":0,"rows_kept":0,"cut":false,"hidden":true,"merged":[]}

{"sheet":"Blad 1 Totala intäkter","index":4,"n_rows":40,"n_cols":18,"rows_kept":40,"cut":false,"hidden":true,"merged":[]}
["Totala intäkter",{"$f":"'Blad 2 Indata'!A2","v":""}]
[{"$f":"TODAY()","v":"2024-04-26"},null,null,{"$f":"IF('Blad 2 Indata'!B1>0,(IF(('Blad 6 Befolkningsförändringar'!D110+'Blad 6 Befolkningsförändringar'!E110+'Blad 6 Befolkningsförändringar'!F110+'Blad 6 Befolkningsförändringar'!G110)>0,IF('Blad 2 Indata'!P5<3,\"Din befolkningsprognos ger ersättning för eftersläpningseffekter som ej ingår i resultatet nedan. Se textrutan blad 6, rad 112 för mer info\",\" \"),\" \")),\" \")","v":" "}]
["Rikets skatteunderlag","Eget skatteunderlag",null,"Antal invånare",null,"Kostnadsutjämning",null,"Skattesats",null,"Statsbidrag",null,"Fastighetsavgift"]
[{"$f":"IF('Blad 2 Indata'!$L$3=1,\"SKR\",\"Egen prognos\")","v":"SKR"},{"$f":"IF('Blad 2 Indata'!$N$3=1,\"Riksprognos\",\"Egen prognos\")","v":"Riksprognos"},null,{"$f":"IF('Blad 2 Indata'!$O$3=1,\"Riksprognos\",\"Egen prognos\")","v":"Riksprognos"},null,{"$f":"IF('Blad 2 Indata'!$P$5=1,\"Senaste utfall utan pris\",IF('Blad 2 Indata'!$P$5=2,\"Senaste utfall med pris\",IF('Blad 2 Indata'!$P$5=3,\"Demografi utan pris\",\"Demografi med pris\")))","v":"Senaste utfall utan pris"}]
[]
[]
[{"$f":"IF(AND('Blad 2 Indata'!T3=2,SUM('Blad 2 Indata'!D59:F59)<>0),\"Förändrad skattesats, %\",\" \")","v":" "},null,{"$f":"IF(AND('Blad 2 Indata'!$T$3=2,'Blad 2 Indata'!D59<>0),'Blad 2 Indata'!D59,\" \")","v":" "},{"$f":"IF(AND('Blad 2 Indata'!$T$3=2,'Blad 2 Indata'!E59<>0),'Blad 2 Indata'!E59,\" \")","v":" "},{"$f":"IF(AND('Blad 2 Indata'!$T$3=2,'Blad 2 Indata'!F59<>0),'Blad 2 Indata'!F59,\" \")","v":" "},{"$f":"IF(AND('Blad 2 Indata'!$T$3=2,'Blad 2 Indata'!G59<>0),'Blad 2 Indata'!G59,\" \")","v":" "},{"$f":"IF(AND('Blad 2 Indata'!$T$3=2,'Blad 2 Indata'!H59<>0),'Blad 2 Indata'!H59,\" \")","v":" "},{"$f":"IF(AND('Blad 2 Indata'!$T$3=2,'Blad 2 Indata'!I59<>0),'Blad 2 Indata'!I59,\" \")","v":" "},{"$f":"IF(AND('Blad 2 Indata'!$T$3=2,'Blad 2 Indata'!J59<>0),'Blad 2 Indata'!J59,\" \")","v":" "}]
[]
[null,2024,{"$f":"B9+1","v":2025},2026,2027,2028,2029,2030,2031,null,{"$f":"B9","v":2024},{"$f":"K9+1","v":2025},2026,2027,2028,2029,2030,2031]
[null,"tkr","tkr","tkr","tkr","tkr","tkr","tkr","tkr",null,"kr/inv","kr/inv","kr/inv","kr/inv","kr/inv","kr/inv","kr/inv","kr/inv"]
[]
["Skatteintäkter",{"$f":"ROUND('Blad 3 Inkomstutjämning'!C24*1000*'Blad 2 Indata'!C60/100,0)/1000","v":0},{"$f":"ROUND('Blad 3 Inkomstutjämning'!D24*1000*'Blad 2 Indata'!D60/100,0)/1000","v":0},{"$f":"ROUND('Blad 3 Inkomstutjämning'!E24*1000*'Blad 2 Indata'!E60/100,0)/1000","v":0},{"$f":"ROUND('Blad 3 Inkomstutjämning'!F24*1000*'Blad 2 Indata'!F60/100,0)/1000","v":0},{"$f":"ROUND('Blad 3 Inkomstutjämning'!G24*1000*'Blad 2 Indata'!G60/100,0)/1000","v":0},{"$f":"ROUND('Blad 3 Inkomstutjämning'!H24*1000*'Blad 2 Indata'!H60/100,0)/1000","v":0},{"$f":"ROUND('Blad 3 Inkomstutjämning'!I24*1000*'Blad 2 Indata'!I60/100,0)/1000","v":0},{"$f":"ROUND('Blad 3 Inkomstutjämning'!J24*1000*'Blad 2 Indata'!J60/100,0)/1000","v":0},null,{"$f":"IF(ISERROR(B12*1000/'Blad 2 Indata'!C29),0,(B12*1000/'Blad 2 Indata'!C29))","v":0},{"$f":"IF(ISERROR(C12/IF('Blad 2 Indata'!$O$3=1,'Blad 2 Indata'!D29/1000,'Blad 2 Indata'!D30/1000)),0,(C12/IF('Blad 2 Indata'!$O$3=1,'Blad 2 Indata'!D29/1000,'Blad 2 Indata'!D30/1000)))","v":0},{"$f":"IF(ISERROR(D12/IF('Blad 2 Indata'!$O$3=1,'Blad 2 Indata'!E29/1000,'Blad 2 Indata'!E30/1000)),0,(D12/IF('Blad 2 Indata'!$O$3=1,'Blad 2 Indata'!E29/1000,'Blad 2 Indata'!E30/1000)))","v":0},{"$f":"IF(ISERROR(E12/IF('Blad 2 Indata'!$O$3=1,'Blad 2 Indata'!F29/1000,'Blad 2 Indata'!F30/1000)),0,(E12/IF('Blad 2 Indata'!$O$3=1,'Blad 2 Indata'!F29/1000,'Blad 2 Indata'!F30/1000)))","v":0},{"$f":"IF(ISERROR(F12/IF('Blad 2 Indata'!$O$3=1,'Blad 2 Indata'!G29/1000,'Blad 2 Indata'!G30/1000)),0,(F12/IF('Blad 2 Indata'!$O$3=1,'Blad 2 Indata'!G29/1000,'Blad 2 Indata'!G30/1000)))","v":0},{"$f":"IF(ISERROR(G12/IF('Blad 2 Indata'!$O$3=1,'Blad 2 Indata'!H29/1000,'Blad 2 Indata'!H30/1000)),0,(G12/IF('Blad 2 Indata'!$O$3=1,'Blad 2 Indata'!H29/1000,'Blad 2 Indata'!H30/1000)))","v":0},{"$f":"IF(ISERROR(H12/IF('Blad 2 Indata'!$O$3=1,'Blad 2 Indata'!I29/1000,'Blad 2 Indata'!I30/1000)),0,(H12/IF('Blad 2 Indata'!$O$3=1,'Blad 2 Indata'!I29/1000,'Blad 2 Indata'!I30/1000)))","v":0},{"$f":"IF(ISERROR(I12/IF('Blad 2 Indata'!$O$3=1,'Blad 2 Indata'!J29/1000,'Blad 2 Indata'!J30/1000)),0,(I12/IF('Blad 2 Indata'!$O$3=1,'Blad 2 Indata'!J29/1000,'Blad 2 Indata'!J30/1000)))","v":0}]
[]
["Inkomstutjämning",{"$f":"'Blad 3 Inkomstutjämning'!C42+'Blad 3 Inkomstutjämning'!C46","v":0},{"$f":"'Blad 3 Inkomstutjämning'!D42+'Blad 3 Inkomstutjämning'!D46","v":0},{"$f":"'Blad 3 Inkomstutjämning'!E42+'Blad 3 Inkomstutjämning'!E46","v":0},{"$f":"'Blad 3 Inkomstutjämning'!F42+'Blad 3 Inkomstutjämning'!F46","v":0},{"$f":"'Blad 3 Inkomstutjämning'!G42+'Blad 3 Inkomstutjämning'!G46","v":0},{"$f":"'Blad 3 Inkomstutjämning'!H42+'Blad 3 Inkomstutjämning'!H46","v":0},{"$f":"'Blad 3 Inkomstutjämning'!I42+'Blad 3 Inkomstutjämning'!I46","v":0},{"$f":"'Blad 3 Inkomstutjämning'!J42+'Blad 3 Inkomstutjämning'!J46","v":0},null,{"$f":"'Blad 3 Inkomstutjämning'!C41+'Blad 3 Inkomstutjämning'!C45","v":0},{"$f":"'Blad 3 Inkomstutjämning'!D41+'Blad 3 Inkomstutjämning'!D45","v":0},{"$f":"'Blad 3 Inkomstutjämning'!E41+'Blad 3 Inkomstutjämning'!E45","v":0},{"$f":"'Blad 3 Inkomstutjämning'!F41+'Blad 3 Inkomstutjämning'!F45","v":0},{"$f":"'Blad 3 Inkomstutjämning'!G41+'Blad 3 Inkomstutjämning'!G45","v":0},{"$f":"'Blad 3 Inkomstutjämning'!H41+'Blad 3 Inkomstutjämning'!H45","v":0},{"$f":"'Blad 3 Inkomstutjämning'!I41+'Blad 3 Inkomstutjämning'!I45","v":0},{"$f":"'Blad 3 Inkomstutjämning'!J41+'Blad 3 Inkomstutjämning'!J45","v":0}]
[]
["Kostnadsutjämning",{"$f":"K16*'Blad 2 Indata'!C29/1000","v":0},{"$f":"L16*IF('Blad 2 Indata'!$O$3=1,'Blad 2 Indata'!D29/1000,'Blad 2 Indata'!D30/1000)","v":0},{"$f":"M16*IF('Blad 2 Indata'!$O$3=1,'Blad 2 Indata'!E29/1000,'Blad 2 Indata'!E30/1000)","v":0},{"$f":"N16*IF('Blad 2 Indata'!$O$3=1,'Blad 2 Indata'!F29/1000,'Blad 2 Indata'!F30/1000)","v":0},{"$f":"O16*IF('Blad 2 Indata'!$O$3=1,'Blad 2 Indata'!G29/1000,'Blad 2 Indata'!G30/1000)","v":0},{"$f":"P16*IF('Blad 2 Indata'!$O$3=1,'Blad 2 Indata'!H29/1000,'Blad 2 Indata'!H30/1000)","v":0},{"$f":"Q16*IF('Blad 2 Indata'!$O$3=1,'Blad 2 Indata'!I29/1000,'Blad 2 Indata'!I30/1000)","v":0},{"$f":"R16*IF('Blad 2 Indata'!$O$3=1,'Blad 2 Indata'!J29/1000,'Blad 2 Indata'!J30/1000)","v":0},null,{"$f":"'Blad 2 Indata'!C65","v":0},{"$f":"IF(ISERROR('Blad 4 Kostnadsutjämning'!C6),0,('Blad 4 Kostnadsutjämning'!C6))","v":0},{"$f":"IF(ISERROR('Blad 4 Kostnadsutjämning'!D6),0,('Blad 4 Kostnadsutjämning'!D6))","v":0},{"$f":"IF(ISERROR('Blad 4 Kostnadsutjämning'!E6),0,('Blad 4 Kostnadsutjämning'!E6))","v":0},{"$f":"IF(ISERROR('Blad 4 Kostnadsutjämning'!F6),0,('Blad 4 Kostnadsutjämning'!F6))","v":0},{"$f":"IF(ISERROR('Blad 4 Kostnadsutjämning'!G6),0,('Blad 4 Kostnadsutjämning'!G6))","v":0},{"$f":"IF(ISERROR('Blad 4 Kostnadsutjämning'!H6),0,('Blad 4 Kostnadsutjämning'!H6))","v":0},{"$f":"IF(ISERROR('Blad 4 Kostnadsutjämning'!I6),0,('Blad 4 Kostnadsutjämning'!I6))","v":0}]
[]
["Regleringspost",{"$f":"K18*'Blad 2 Indata'!C29/1000","v":0},{"$f":"L18*IF('Blad 2 Indata'!$O$3=1,'Blad 2 Indata'!D29/1000,'Blad 2 Indata'!D30/1000)","v":0},{"$f":"M18*IF('Blad 2 Indata'!$O$3=1,'Blad 2 Indata'!E29/1000,'Blad 2 Indata'!E30/1000)","v":0},{"$f":"N18*IF('Blad 2 Indata'!$O$3=1,'Blad 2 Indata'!F29/1000,'Blad 2 Indata'!F30/1000)","v":0},{"$f":"O18*IF('Blad 2 Indata'!$O$3=1,'Blad 2 Indata'!G29/1000,'Blad 2 Indata'!G30/1000)","v":0},{"$f":"P18*IF('Blad 2 Indata'!$O$3=1,'Blad 2 Indata'!H29/1000,'Blad 2 Indata'!H30/1000)","v":0},{"$f":"Q18*IF('Blad 2 Indata'!$O$3=1,'Blad 2 Indata'!I29/1000,'Blad 2 Indata'!I30/1000)","v":0},{"$f":"R18*IF('Blad 2 Indata'!$O$3=1,'Blad 2 Indata'!J29/1000,'Blad 2 Indata'!J30/1000)","v":0},null,{"$f":"'Blad 2 Indata'!C50","v":3055.3265526466898},{"$f":"'Blad 2 Indata'!D50","v":2386.8693565866788},{"$f":"IF('Blad 2 Indata'!$V$3=1,'Blad 2 Indata'!E50,'Blad 2 Indata'!E51)","v":2086.2456796621973},{"$f":"IF('Blad 2 Indata'!$V$3=1,'Blad 2 Indata'!F50,'Blad 2 Indata'!F51)","v":1733.5504368257364},{"$f":"IF('Blad 2 Indata'!$V$3=1,'Blad 2 Indata'!G50,'Blad 2 Indata'!G51)","v":1355.9701321129437},{"$f":"IF('Blad 2 Indata'!$V$3=1,'Blad 2 Indata'!H50,'Blad 2 Indata'!H51)","v":1038.9118269334435},{"$f":"IF('Blad 2 Indata'!$V$3=1,'Blad 2 Indata'!I50,'Blad 2 Indata'!I51)","v":672.27461693512714},{"$f":"IF('Blad 2 Indata'!$V$3=1,'Blad 2 Indata'!J50,'Blad 2 Indata'!J51)","v":298.98012647399565}]
[]
["Strukturbidrag",{"$f":"K20*IF('Blad 2 Indata'!$O$3=1,'Blad 2 Indata'!C29/1000,'Blad 2 Indata'!C30/1000)","v":0},{"$f":"L20*IF('Blad 2 Indata'!$O$3=1,'Blad 2 Indata'!D29/1000,'Blad 2 Indata'!D30/1000)","v":0},{"$f":"M20*IF('Blad 2 Indata'!$O$3=1,'Blad 2 Indata'!E29/1000,'Blad 2 Indata'!E30/1000)","v":0},{"$f":"N20*IF('Blad 2 Indata'!$O$3=1,'Blad 2 Indata'!F29/1000,'Blad 2 Indata'!F30/1000)","v":0},{"$f":"O20*IF('Blad 2 Indata'!$O$3=1,'Blad 2 Indata'!G29/1000,'Blad 2 Indata'!G30/1000)","v":0},{"$f":"P20*IF('Blad 2 Indata'!$O$3=1,'Blad 2 Indata'!H29/1000,'Blad 2 Indata'!H30/1000)","v":0},{"$f":"Q20*IF('Blad 2 Indata'!$O$3=1,'Blad 2 Indata'!I29/1000,'Blad 2 Indata'!I30/1000)","v":0},{"$f":"R20*IF('Blad 2 Indata'!$O$3=1,'Blad 2 Indata'!J29/1000,'Blad 2 Indata'!J30/1000)","v":0},null,{"$f":"'Blad 5 Inför.- o strukturbidrag'!E14","v":0},{"$f":"'Blad 5 Inför.- o strukturbidrag'!F14","v":0},{"$f":"'Blad 5 Inför.- o strukturbidrag'!G14","v":0},{"$f":"'Blad 5 Inför.- o strukturbidrag'!H14","v":0},{"$f":"'Blad 5 Inför.- o strukturbidrag'!I14","v":0},{"$f":"'Blad 5 Inför.- o strukturbidrag'!J14","v":0},{"$f":"'Blad 5 Inför.- o strukturbidrag'!K14","v":0},{"$f":"'Blad 5 Inför.- o strukturbidrag'!L14","v":0}]
[]
["Införandebidrag",{"$f":"K22*IF('Blad 2 Indata'!$O$3=1,'Blad 2 Indata'!C29/1000,'Blad 2 Indata'!C30/1000)","v":0},{"$f":"L22*IF('Blad 2 Indata'!$O$3=1,'Blad 2 Indata'!D29/1000,'Blad 2 Indata'!D30/1000)","v":0},{"$f":"M22*IF('Blad 2 Indata'!$O$3=1,'Blad 2 Indata'!E29/1000,'Blad 2 Indata'!E30/1000)","v":0},{"$f":"N22*IF('Blad 2 Indata'!$O$3=1,'Blad 2 Indata'!F29/1000,'Blad 2 Indata'!F30/1000)","v":0},{"$f":"O22*IF('Blad 2 Indata'!$O$3=1,'Blad 2 Indata'!G29/1000,'Blad 2 Indata'!G30/1000)","v":0},{"$f":"P22*IF('Blad 2 Indata'!$O$3=1,'Blad 2 Indata'!H29/1000,'Blad 2 Indata'!H30/1000)","v":0},{"$f":"Q22*IF('Blad 2 Indata'!$O$3=1,'Blad 2 Indata'!I29/1000,'Blad 2 Indata'!I30/1000)","v":0},{"$f":"R22*IF('Blad 2 Indata'!$O$3=1,'Blad 2 Indata'!J29/1000,'Blad 2 Indata'!J30/1000)","v":0},null,{"$f":"'Blad 5 Inför.- o strukturbidrag'!E21","v":0},{"$f":"'Blad 5 Inför.- o strukturbidrag'!F21","v":0},{"$f":"'Blad 5 Inför.- o strukturbidrag'!G21","v":0},{"$f":"'Blad 5 Inför.- o strukturbidrag'!H21","v":0},{"$f":"'Blad 5 Inför.- o strukturbidrag'!I21","v":0},{"$f":"'Blad 5 Inför.- o strukturbidrag'!J21","v":0},{"$f":"'Blad 5 Inför.- o strukturbidrag'!K21","v":0},{"$f":"'Blad 5 Inför.- o strukturbidrag'!L21","v":0}]
[]
["LSS-utjämning ",{"$f":"K24*IF('Blad 2 Indata'!$O$3=1,'Blad 2 Indata'!C29/1000,'Blad 2 Indata'!C30/1000)","v":0},{"$f":"L24*IF('Blad 2 Indata'!$O$3=1,'Blad 2 Indata'!D29/1000,'Blad 2 Indata'!D30/1000)","v":0},{"$f":"M24*IF('Blad 2 Indata'!$O$3=1,'Blad 2 Indata'!E29/1000,'Blad 2 Indata'!E30/1000)","v":0},{"$f":"N24*IF('Blad 2 Indata'!$O$3=1,'Blad 2 Indata'!F29/1000,'Blad 2 Indata'!F30/1000)","v":0},{"$f":"O24*IF('Blad 2 Indata'!$O$3=1,'Blad 2 Indata'!G29/1000,'Blad 2 Indata'!G30/1000)","v":0},{"$f":"P24*IF('Blad 2 Indata'!$O$3=1,'Blad 2 Indata'!H29/1000,'Blad 2 Indata'!H30/1000)","v":0},{"$f":"Q24*IF('Blad 2 Indata'!$O$3=1,'Blad 2 Indata'!I29/1000,'Blad 2 Indata'!I30/1000)","v":0},{"$f":"R24*IF('Blad 2 Indata'!$O$3=1,'Blad 2 Indata'!J29/1000,'Blad 2 Indata'!J30/1000)","v":0},null,{"$f":"'Blad 2 Indata'!C68","v":0},{"$f":"'Blad 2 Indata'!D68","v":0},{"$f":"'Blad 2 Indata'!E68","v":0},{"$f":"'Blad 2 Indata'!F68","v":0},{"$f":"'Blad 2 Indata'!G68","v":0},{"$f":"'Blad 2 Indata'!H68","v":0},{"$f":"'Blad 2 Indata'!I68","v":0},{"$f":"'Blad 2 Indata'!J68","v":0}]
[]
["Summa intäkter",{"$f":"SUM(B12,B14,B16,B20,B18,B24,B22)","v":0},0,0,0,0,0,0,0,null,{"$f":"SUM(K12,K14,K16,K20,K18,K24,K22)","v":3055.3265526466898},2386.8693565866788,2086.2456796621973,1733.5504368257364,1355.9701321129437,1038.9118269334435,672.27461693512714,298.98012647399565]
[]
[{"$f":"\"Slutavräkning \"&B9-1&\" korrigering\"","v":"Slutavräkning 2023 korrigering"},{"$f":"(K28*'Blad 2 Indata'!B29)/1000","v":0},null,null,null,null,null,null,null,null,-87]
[]
[{"$f":"\"Slutavräkning \"&B9","v":"Slutavräkning 2024"},{"$f":"(K30*'Blad 2 Indata'!C29)/1000","v":0},{"$f":"(L30*'Blad 2 Indata'!C29)/1000","v":0},null,null,null,null,null,null,null,20]
[]
[{"$f":"\"Slutavräkning \"&C9","v":"Slutavräkning 2025"},null,{"$f":"IF('Blad 2 Indata'!O3=1,(L32*'Blad 2 Indata'!D29)/1000,(L32*'Blad 2 Indata'!D30)/1000)","v":0}]
[]
["Fastighetsavgift",{"$f":"'Blad 2 Indata'!C95","v":0},{"$f":"'Blad 2 Indata'!D95","v":0},{"$f":"'Blad 2 Indata'!E95","v":0},{"$f":"'Blad 2 Indata'!F95","v":0},{"$f":"'Blad 2 Indata'!G95","v":0},{"$f":"'Blad 2 Indata'!H95","v":0},{"$f":"'Blad 2 Indata'!I95","v":0},{"$f":"'Blad 2 Indata'!J95","v":0},null,{"$f":"'Blad 2 Indata'!C96","v":{"$error":"#DIV/0!"}},{"$f":"'Blad 2 Indata'!D96","v":{"$error":"#DIV/0!"}},{"$f":"'Blad 2 Indata'!E96","v":{"$error":"#DIV/0!"}},{"$f":"'Blad 2 Indata'!F96","v":{"$error":"#DIV/0!"}},{"$f":"'Blad 2 Indata'!G96","v":{"$error":"#DIV/0!"}},{"$f":"'Blad 2 Indata'!H96","v":{"$error":"#DIV/0!"}},{"$f":"'Blad 2 Indata'!I96","v":{"$error":"#DIV/0!"}},{"$f":"'Blad 2 Indata'!J96","v":{"$error":"#DIV/0!"}}]
[]
["Summa intäkter (inkl. avräkning)+f-avgift",{"$f":"B26+B28+B30+B32+B34","v":0},{"$f":"C26+C28+C30+C32+C34","v":0},{"$f":"D26+D28+D30+D32+D34","v":0},0,0,0,0,0,null,{"$f":"K26+K28+K30+K32+K34","v":{"$error":"#DIV/0!"}},{"$error":"#DIV/0!"},{"$error":"#DIV/0!"},{"$error":"#DIV/0!"},{"$error":"#DIV/0!"},{"$error":"#DIV/0!"},{"$error":"#DIV/0!"},{"$error":"#DIV/0!"}]
[]
["Skatteintäkter",{"$f":"+B12+B28+B30+B32","v":0},{"$f":"+C12+C28+C30+C32","v":0},{"$f":"+D12+D28+D30+D32","v":0},0,0,0,0,0]
[]
["Gen. Stb o utj",{"$f":"B14+B16+B18+B20+B22+B24+B34","v":0},{"$f":"C14+C16+C18+C20+C22+C24+C34","v":0},{"$f":"D14+D16+D18+D20+D22+D24+D34","v":0},0,0,0,0,0]

{"sheet":"Blad 2 Indata","index":5,"n_rows":112,"n_cols":24,"rows_kept":112,"cut":false,"hidden":true,"merged":[]}
[null,{"$f":"Prognosunderlag!B1","v":0},{"$f":"IF(B1>0,\" \",\"Skriv in kommunens kommunkod i cellen B1\")","v":"Skriv in kommunens kommunkod i cellen B1"},null,null,null,null,null,null,null,null,"SKR",null,"Riksprognos",null,"Senaste utfall utan pris",null,"Oförändrat",null,"Oförändrad",null,"Ej värdesäkrat",null,"Med fastighetavgift nominellt oförändrad"]
[{"$f":"IF(ISERROR(VLOOKUP(B1,Data!A2:AZ292,2)),\"\",(VLOOKUP(B1,Data!A2:AZ292,2)))","v":""},null,null,null,null,null,null,null,null,null,null,"Egen prognos",null,"Egen prognos",null,"Senaste utfall med pris",null,"Egen prognos",null,"Förändrad",null,"Värdesäkrat",null,"Utan fastighetsavgift"]
[null,{"$f":"'Blad 1 Totala intäkter'!B9-1","v":2023},{"$f":"B3+1","v":2024},2025,2026,2027,2028,2029,{"$f":"H3+1","v":2030},{"$f":"I3+1","v":2031},null,1,null,1,1,"Demografi utan pris",null,1,null,1,null,1,null,"Egen prognos"]
[null,null,null,null,null,null,null,null,null,null,null,null,null,null,null,"Demografi med pris",null,null,null,null,null,null,null,1]
["Uppräkningsfaktorer",null,null,null,null,null,null,null,null,null,null,null,null,null,null,1]
["Rikets skatteunderlag, %"]
[{"$f":"\"Fastställt för \"&C3","v":"Fastställt för 2024"},4.5999999999999996,3.3,null," "]
[{"$f":"\"Fastställt för \"&D3","v":"Fastställt för 2025"}]
["Sveriges Kommuner och Regioners prognos",5.0943595873486291,2.8500526395127901,4.758554999090614,4.1273943366828991,4.0119628964820242,4.0813872004546337,3.3005944829045397,3.7130154970406171,3.6633313430403325]
["Egna antaganden"]
[{"$f":"\"Beskattningsutfall inkomstår \"&B3","v":"Beskattningsutfall inkomstår 2023"},{"$f":"(IF(C19>0,(C19/B19-1)*100,0))","v":0}]
[]
["Kommunens skatteunderlag, %"]
["Riksprognos",{"$f":"IF(B16<>0,B16,IF('Blad 2 Indata'!$L3=1,'Blad 2 Indata'!B9,'Blad 2 Indata'!B10))","v":5.0943595873486291},{"$f":"IF('Blad 2 Indata'!$L3=1,'Blad 2 Indata'!C9,'Blad 2 Indata'!C10)","v":2.8500526395127901},{"$f":"IF('Blad 2 Indata'!$L3=1,'Blad 2 Indata'!D9,'Blad 2 Indata'!D10)","v":4.758554999090614},{"$f":"IF('Blad 2 Indata'!$L3=1,'Blad 2 Indata'!E9,'Blad 2 Indata'!E10)","v":4.1273943366828991},{"$f":"IF('Blad 2 Indata'!$L3=1,'Blad 2 Indata'!F9,'Blad 2 Indata'!F10)","v":4.0119628964820242},{"$f":"IF('Blad 2 Indata'!$L3=1,'Blad 2 Indata'!G9,'Blad 2 Indata'!G10)","v":4.0813872004546337},{"$f":"IF('Blad 2 Indata'!$L3=1,'Blad 2 Indata'!H9,'Blad 2 Indata'!H10)","v":3.3005944829045397},{"$f":"IF('Blad 2 Indata'!$L3=1,'Blad 2 Indata'!I9,'Blad 2 Indata'!I10)","v":3.7130154970406171},{"$f":"IF('Blad 2 Indata'!$L3=1,'Blad 2 Indata'!J9,'Blad 2 Indata'!J10)","v":3.6633313430403325}]
["Egna antaganden",{"$f":"IF(ISERROR(((1+(B14/100))*(B29/E88)/(B26/Data!BN294)-1)*100),0,IF(B16<>0,B16,((1+(B14/100))*(B29/E88)/(B26/Data!BN294)-1)*100))","v":0},{"$f":"IF(ISERROR(((1+(C14/100))*(C30/B30)/(C26/B26)-1)*100),0,((1+(C14/100))*(C30/B30)/(C26/B26)-1)*100)","v":0},{"$f":"IF(ISERROR(IF(D30>0,((1+(D14/100))*(D30/C30)/(D26/C26)-1)*100,((1+(D14/100))*(D29/C29)/(D26/C26)-1)*100)),0,IF(D30>0,((1+(D14/100))*(D30/C30)/(D26/C26)-1)*100,((1+(D14/100))*(D29/C29)/(D26/C26)-1)*100))","v":0},0,{"$f":"IF(ISERROR(IF(F30>0,((1+(F14/100))*(F30/E30)/(F26/E26)-1)*100,((1+(F14/100))*(F29/E29)/(F26/E26)-1)*100)),0,IF(F30>0,((1+(F14/100))*(F30/E30)/(F26/E26)-1)*100,((1+(F14/100))*(F29/E29)/(F26/E26)-1)*100))","v":0},0,0,0,0]
[{"$f":"\"Beskattningsutfall inkomstår \"&B3","v":"Beskattningsutfall inkomstår 2023"},{"$f":"IF(C20>0,(C20/B20-1)*100,0)","v":0}]
[]
[{"$f":"\"Skatteunderlag inkomstår \"&B3-1&\" och \"&B3","v":"Skatteunderlag inkomstår 2022 och 2023"}]
["Riket, miljoner kr",2645513.4868999999]
["Kommunen, tkr",{"$f":"IF(ISERROR(VLOOKUP(B1,Data!A2:AZ292,3)),0,(VLOOKUP(B1,Data!A2:AZ292,3)))","v":0},{"$f":"IF(ISERROR(VLOOKUP(B1,Data!A2:AZ292,4)),0,(VLOOKUP(B1,Data!A2:AZ292,4)))","v":0}]
[]
[]
["Antal invånare den 1.11 året innan"]
["Riket"]
["Förändring i procent",null,{"$f":"((C26-B26)/B26)*100","v":0.40859865109091359},0.24653138823465226,0.23247046640544763,0.2236830470892924,0.21140809908312069,0.2166498349996058,0.22090163869175508,{"$f":"((J26-I26)/I26)*100","v":0.227404615748342}]
["Antal invånare i riket ",10514719,10557682,10583710,10608314,10632043,10654520,10677603,10701190,10725525]
[]
["Kommunen"]
["Enligt riksprognos",{"$f":"IF(ISERROR(VLOOKUP(B1,Data!A2:AZ292,5)),0,(VLOOKUP(B1,Data!A2:AZ292,5)))","v":0},{"$f":"IF(ISERROR(VLOOKUP(B1,Data!A2:AZ292,6)),0,(VLOOKUP(B1,Data!A2:AZ292,6)))","v":0},{"$f":"ROUND(IF(ISERROR(VLOOKUP(B1,Data!A2:DH292,7)),0,(VLOOKUP(B1,Data!A2:DH292,7))),0)","v":0},{"$f":"ROUND(IF(ISERROR(VLOOKUP(B1,Data!A2:DH292,8)),0,(VLOOKUP(B1,Data!A2:DH292,8))),0)","v":0},{"$f":"ROUND(IF(ISERROR(VLOOKUP(B1,Data!A2:DH292,9)),0,(VLOOKUP(B1,Data!A2:DH292,9))),0)","v":0},{"$f":"ROUND(IF(ISERROR(VLOOKUP(B1,Data!A2:DH292,10)),0,(VLOOKUP(B1,Data!A2:DH292,10))),0)","v":0},{"$f":"INT(+G29*(1+H25/100))","v":0},{"$f":"INT(+H29*(1+I25/100))","v":0},{"$f":"INT(+I29*(1+J25/100))","v":0}]
["Egna antaganden",{"$f":"$B$29","v":0},{"$f":"$C$29","v":0}]
[]
["Anslag kommunalek. utj.",108030.82600000002,119175.95600000001,116402.95600000001,116993.95600000001,117058.95600000001,117058.95600000001,117058.95600000001,117058.95600000001,117058.95600000001]
["Värdesäkrad beräkning",null,null,null,null,{"$f":"(+E32+Data!DE2)*(F107/100+1)","v":121245.87816690751},{"$f":"F33*(G107/100+1)","v":125636.93899986558},{"$f":"G33*(H107/100+1)","v":130193.8368842138},{"$f":"H33*(I107/100+1)","v":134921.73909029446},{"$f":"I33*(J107/100+1)","v":139830.4044141706}]
[]
["Inkomstutjämningsbidrag, netto"]
["SKR:s bedömning",82467.959067000003,85973.155518,90095.989346000002,93814.949794,97577.972760999997,101559.721298,104911.564764,108808.183108,112793.200165]
["Egen bedömning ",{"$f":"+B36","v":82467.959067000003},{"$f":"+C36","v":85973.155518},{"$f":"+IF($L$3=1,0,IF(C8>0,D36,D36*(1+($B10-$B9)/100)*(1+($C10-$C9)/100)*(1+(D10-D9)/100)))","v":0},{"$f":"+IF($L$3=1,0,E36*(1+($B10-$B9)/100)*(1+($C10-$C9)/100)*(1+(D10-D9)/100))*(1+(E10-E9)/100)","v":0},{"$f":"+IF($L$3=1,0,F36*(1+($B10-$B9)/100)*(1+($C10-$C9)/100)*(1+(D10-D9)/100)*(1+(E10-E9)/100)*(1+(F10-F9)/100))","v":0},{"$f":"+IF($L$3=1,0,G36*(1+($B10-$B9)/100)*(1+($C10-$C9)/100)*(1+(D10-D9)/100)*(1+(E10-E9)/100)*(1+(F10-F9)/100)*(1+(G10-G9)/100))","v":0},{"$f":"+IF($L$3=1,0,H36*(1+($B10-$B9)/100)*(1+($C10-$C9)/100)*(1+(D10-D9)/100)*(1+(E10-E9)/100)*(1+(F10-F9)/100)*(1+(G10-G9)/100)*(1+(H10-H9)/100))","v":0},{"$f":"+IF($L$3=1,0,I36*(1+($B10-$B9)/100)*(1+($C10-$C9)/100)*(1+(D10-D9)/100)*(1+(E10-E9)/100)*(1+(F10-F9)/100)*(1+(G10-G9)/100)*(1+(H10-H9)/100)*(1+(I10-I9)/100))","v":0},{"$f":"+IF($L$3=1,0,J36*(1+($B10-$B9)/100)*(1+($C10-$C9)/100)*(1+(D10-D9)/100)*(1+(E10-E9)/100)*(1+(F10-F9)/100)*(1+(G10-G9)/100)*(1+(H10-H9)/100)*(1+(I10-I9)/100)*(1+(J10-J9)/100))","v":0}]
[]
["Kostnadsutjämning, netto"]
["Miljoner kronor",-71.761028000000806,-96.831093000000692]
[]
["Strukturbidrag"]
["Miljoner kronor",1046.5177679999999,1042.465426,1045.033576,1047.4569550000001,1049.800452,1052.0238099999999,1054.3031960000001,1056.6344839999999,1059.037014]
[]
["Införandebidrag"]
["Miljoner kronor",27.756599000000001,0,0,0,0,0,0,0,0]
[]
["Regleringsbidrag/-avgift"]
["Miljoner kronor",{"$f":"B32-(B40+B36+B43+B46)","v":24560.353594},{"$f":"C32-(C40+C36+C43+C46)","v":32257.166149000012},{"$f":"IF(D37>0,D32-SUM(D40,D37,D43,D46),D32-SUM(D40,D36,D43,D46))","v":25261.933078000002},22131.549251000004,18431.182787000012,14447.210892000003,11093.088040000017,7194.1384080000134,3206.7188210000022]
["Kronor per invånare",{"$f":"(B49*1000000)/B26","v":2335.8069382548406},3055.3265526466898,2386.8693565866788,2086.2456796621973,1733.5504368257364,1355.9701321129437,1038.9118269334435,672.27461693512714,298.98012647399565]
["Om egen prognos rikets skatteunderlag och/eller anslag",null,null,{"$f":"IF($L3+$V3=2,0,D50)","v":0},{"$f":"IF($L3+$V3=2,0,E50)","v":0},{"$f":"IF($L3+$V3=2,0,F50+((F33-F32)/(F26/1000000)))","v":0},{"$f":"IF($L3+$V3=2,0,G50+((G33-G32)/(G26/1000000)))","v":0},{"$f":"IF($L3+$V3=2,0,H50+((H33-H32)/(H26/1000000)))","v":0},{"$f":"IF($L3+$V3=2,0,I50+((I33-I32)/(I26/1000000)))","v":0},{"$f":"IF($L3+$V3=2,0,J50+((J33-J32)/(J26/1000000)))","v":0}]
[]
["Garantinivå, procent",null,1.1499999999999999,{"$f":"C53","v":1.1499999999999999},{"$f":"D53","v":1.1499999999999999},1.1499999999999999,1.1499999999999999,1.1499999999999999,1.1499999999999999,1.1499999999999999]
[]
["Konsumentprisindex"]
["Sveriges Kommuner och Regioners prognos",8.5486248974891321,2.6293930874733418,0.4488786213272089,1.6619440856880718,2.1080328909825363,2.1727128377435401,2.1384508973766758,2.0995805511258014,2.0995805511258014]
[]
["Skattesatser",null,null,"+/–","+/–","+/–","+/–","+/–","+/–","+/–"]
["Ändrad skattesats, procentenheter"]
["Kommunens skattesats",{"$f":"IF(ISERROR(VLOOKUP(B1,Data!A2:AZ292,11)),0,(VLOOKUP(B1,Data!A2:AZ292,11)))","v":0},{"$f":"IF(ISERROR(VLOOKUP(B1,Data!A2:AZ292,12)),0,(VLOOKUP(B1,Data!A2:AZ292,12)))","v":0},{"$f":"IF(ISERROR(IF((VLOOKUP(B1,Data!A2:AL292,13))=0,(IF($T$3=2,C60+D59,C60)),(VLOOKUP(B1,Data!A2:AL292,13)))),0,(IF((VLOOKUP(B1,Data!A2:AL292,13))=0,(IF($T$3=2,C60+D59,C60)),(VLOOKUP(B1,Data!A2:AL292,13)))))","v":0},{"$f":"IF($T$3=2,D60+E59,D60)","v":0},0,0,0,0,0]
["Länsvis skattesats, 95%",null,{"$f":"IF(ISERROR(VLOOKUP(B1,Data!A2:AZ292,14)),0,(VLOOKUP(B1,Data!A2:AZ292,14)))","v":0},{"$f":"IF(ISERROR(VLOOKUP(B1,Data!A2:DH292,86)),0,(VLOOKUP(B1,Data!A2:DH292,86)))","v":0},{"$f":"D61","v":0},0,0,0,0,0]
["               -\"-        , 85%",null,{"$f":"IF(ISERROR(VLOOKUP(B1,Data!A2:AZ292,15)),0,(VLOOKUP(B1,Data!A2:AZ292,15)))","v":0},{"$f":"IF(ISERROR(VLOOKUP(B1,Data!A2:DH292,87)),0,(VLOOKUP(B1,Data!A2:DH292,87)))","v":0},0,0,0,0,0,0]
[]
["Kostnadsutjämning"]
[{"$f":"\"Kostnadsutjämning \"&C3&\" och \"&D3","v":"Kostnadsutjämning 2024 och 2025"},null,{"$f":"ROUND(IF(ISERROR(VLOOKUP(B1,Data!A2:AZ292,17)),0,(VLOOKUP(B1,Data!A2:AZ292,17))),0)","v":0},{"$f":"IF((ROUND(IF(ISERROR(VLOOKUP(B1,Data!A2:DH292,18)),0,(VLOOKUP(B1,Data!A2:DH292,18))),8))=0,0,(ROUND(IF(ISERROR(VLOOKUP(B1,Data!A2:DH292,18)),0,(VLOOKUP(B1,Data!A2:DH292,18))),8))+(IF(P5>2,'Blad 6 Befolkningsförändringar'!D110,0)))","v":0}]
[]
["LSS-utjämning"]
["Bidrag/avgift (exkl. införanderegler)",null,{"$f":"IF(ISERROR(VLOOKUP(B1,Data!A2:DH292,19)),0,(VLOOKUP(B1,Data!A2:DH292,19)))","v":0},{"$f":"IF(IF(ISERROR(VLOOKUP(B1,Data!A2:DH292,20)),0,(VLOOKUP(B1,Data!A2:DH292,20)))=0,C68,(IF(ISERROR(VLOOKUP(B1,Data!A2:DH292,20)),0,(VLOOKUP(B1,Data!A2:DH292,20)))))","v":0},{"$f":"D68","v":0},0,0,0,0,0]
[]
["Antal invånare den 31.12 året innan"]
["Totalt",{"$f":"IF(ISERROR(VLOOKUP($B$1,Data!$A$2:$DH$292,21)),0,(VLOOKUP($B$1,Data!$A$2:$DH$292,21)))","v":0},{"$f":"(IF(ISERROR(VLOOKUP($B$1,Data!A$2:DZ$292,22)),0,(VLOOKUP($B$1,Data!A$2:DZ$292,22))))","v":0}]
["1-5 år",{"$f":"IF(ISERROR(VLOOKUP($B$1,Data!$A$2:$DH$292,23)),0,(VLOOKUP($B$1,Data!$A$2:$DH$292,23)))","v":0},{"$f":"IF(ISERROR(VLOOKUP($B$1,Data!$A$2:$DZ$292,31)),0,(VLOOKUP($B$1,Data!$A$2:$DZ$292,31)))","v":0}]
["6-12 år",{"$f":"IF(ISERROR(VLOOKUP($B$1,Data!$A$2:$DH$292,24)),0,(VLOOKUP($B$1,Data!$A$2:$DH$292,24)))","v":0},{"$f":"IF(ISERROR(VLOOKUP($B$1,Data!$A$2:$DZ$292,32)),0,(VLOOKUP($B$1,Data!$A$2:$DZ$292,32)))","v":0}]
["6 år",{"$f":"IF(ISERROR(VLOOKUP($B$1,Data!$A$2:$DH$292,25)),0,(VLOOKUP($B$1,Data!$A$2:$DH$292,25)))","v":0},{"$f":"IF(ISERROR(VLOOKUP($B$1,Data!$A$2:$DZ$292,33)),0,(VLOOKUP($B$1,Data!$A$2:$DZ$292,33)))","v":0}]
["7-15 år",{"$f":"IF(ISERROR(VLOOKUP($B$1,Data!$A$2:$DH$292,26)),0,(VLOOKUP($B$1,Data!$A$2:$DH$292,26)))","v":0},{"$f":"IF(ISERROR(VLOOKUP($B$1,Data!$A$2:$DZ$292,34)),0,(VLOOKUP($B$1,Data!$A$2:$DZ$292,34)))","v":0}]
["16-18 år",{"$f":"IF(ISERROR(VLOOKUP($B$1,Data!$A$2:$DH$292,27)),0,(VLOOKUP($B$1,Data!$A$2:$DH$292,27)))","v":0},{"$f":"IF(ISERROR(VLOOKUP($B$1,Data!$A$2:$DZ$292,35)),0,(VLOOKUP($B$1,Data!$A$2:$DZ$292,35)))","v":0}]
["65-79 år",{"$f":"IF(ISERROR(VLOOKUP($B$1,Data!$A$2:$DH$292,28)),0,(VLOOKUP($B$1,Data!$A$2:$DH$292,28)))","v":0},{"$f":"IF(ISERROR(VLOOKUP($B$1,Data!$A$2:$DZ$292,36)),0,(VLOOKUP($B$1,Data!$A$2:$DZ$292,36)))","v":0}]
["80-89 år",{"$f":"IF(ISERROR(VLOOKUP($B$1,Data!$A$2:$DH$292,29)),0,(VLOOKUP($B$1,Data!$A$2:$DH$292,29)))","v":0},{"$f":"IF(ISERROR(VLOOKUP($B$1,Data!$A$2:$DZ$292,37)),0,(VLOOKUP($B$1,Data!$A$2:$DZ$292,37)))","v":0}]
["90-",{"$f":"IF(ISERROR(VLOOKUP($B$1,Data!$A$2:$DH$292,30)),0,(VLOOKUP($B$1,Data!$A$2:$DH$292,30)))","v":0},{"$f":"IF(ISERROR(VLOOKUP($B$1,Data!$A$2:$DZ$292,38)),0,(VLOOKUP($B$1,Data!$A$2:$DZ$292,38)))","v":0}]
[]
["Totalt, 10 år innan",{"$f":"IF(ISERROR(VLOOKUP($B$1,Data!$A$2:$DH$292,39)),0,(VLOOKUP($B$1,Data!$A$2:$DH$292,39)))","v":0},{"$f":"IF(ISERROR(VLOOKUP($B$1,Data!$A$2:$DH$292,40)),0,(VLOOKUP($B$1,Data!$A$2:$DH$292,40)))","v":0},{"$f":"IF(ISERROR(VLOOKUP($B$1,Data!$A$2:$DH$292,41)),0,(VLOOKUP($B$1,Data!$A$2:$DH$292,41)))","v":0},{"$f":"IF(ISERROR(VLOOKUP($B$1,Data!$A$2:$DH$292,42)),0,(VLOOKUP($B$1,Data!$A$2:$DH$292,42)))","v":0},{"$f":"IF(ISERROR(VLOOKUP($B$1,Data!$A$2:$DH$292,43)),0,(VLOOKUP($B$1,Data!$A$2:$DH$292,43)))","v":0},{"$f":"IF(ISERROR(VLOOKUP($B$1,Data!$A$2:$DH$292,44)),0,(VLOOKUP($B$1,Data!$A$2:$DH$292,44)))","v":0},{"$f":"IF(ISERROR(VLOOKUP($B$1,Data!$A$2:$DH$292,46)),0,(VLOOKUP($B$1,Data!$A$2:$DH$292,46)))","v":0},{"$f":"IF(ISERROR(VLOOKUP($B$1,Data!$A$2:$DH$292,47)),0,(VLOOKUP($B$1,Data!$A$2:$DH$292,47)))","v":0},{"$f":"IF(ISERROR(VLOOKUP($B$1,Data!$A$2:$DH$292,48)),0,(VLOOKUP($B$1,Data!$A$2:$DH$292,48)))","v":0}]
["Totalt, 5 år innan",{"$f":"IF(ISERROR(VLOOKUP($B$1,Data!$A$2:$DH$292,45)),0,(VLOOKUP($B$1,Data!$A$2:$DH$292,45)))","v":0},{"$f":"IF(ISERROR(VLOOKUP($B$1,Data!$A$2:$DH$292,46)),0,(VLOOKUP($B$1,Data!$A$2:$DH$292,46)))","v":0},{"$f":"IF(ISERROR(VLOOKUP($B$1,Data!$A$2:$DH$292,47)),0,(VLOOKUP($B$1,Data!$A$2:$DH$292,47)))","v":0},{"$f":"IF(ISERROR(VLOOKUP($B$1,Data!$A$2:$DH$292,48)),0,(VLOOKUP($B$1,Data!$A$2:$DH$292,48)))","v":0},{"$f":"IF(ISERROR(VLOOKUP($B$1,Data!$A$2:$DH$292,49)),0,(VLOOKUP($B$1,Data!$A$2:$DH$292,49)))","v":0},{"$f":"IF(ISERROR(VLOOKUP($B$1,Data!$A$2:$DH$292,50)),0,(VLOOKUP($B$1,Data!$A$2:$DH$292,50)))","v":0},{"$f":"+C71","v":0},{"$f":"+D71","v":0},{"$f":"+E71","v":0}]
["1-5 år, 5 år innan",{"$f":"IF(ISERROR(VLOOKUP($B$1,Data!$A$2:$DH$292,57)),0,(VLOOKUP($B$1,Data!$A$2:$DH$292,57)))","v":0},{"$f":"IF(ISERROR(VLOOKUP($B$1,Data!$A$2:$DH$292,58)),0,(VLOOKUP($B$1,Data!$A$2:$DH$292,58)))","v":0},{"$f":"IF(ISERROR(VLOOKUP($B$1,Data!$A$2:$DH$292,59)),0,(VLOOKUP($B$1,Data!$A$2:$DH$292,59)))","v":0},{"$f":"IF(ISERROR(VLOOKUP($B$1,Data!$A$2:$DH$292,60)),0,(VLOOKUP($B$1,Data!$A$2:$DH$292,60)))","v":0},{"$f":"IF(ISERROR(VLOOKUP($B$1,Data!$A$2:$DH$292,61)),0,(VLOOKUP($B$1,Data!$A$2:$DH$292,61)))","v":0},{"$f":"IF(ISERROR(VLOOKUP($B$1,Data!$A$2:$DH$292,62)),0,(VLOOKUP($B$1,Data!$A$2:$DH$292,62)))","v":0},{"$f":"C72","v":0},{"$f":"D72","v":0},{"$f":"E72","v":0}]
["6-15 år, 5 år innan",{"$f":"IF(ISERROR(VLOOKUP($B$1,Data!$A$2:$DH$292,51)),0,(VLOOKUP($B$1,Data!$A$2:$DH$292,51)))","v":0},{"$f":"IF(ISERROR(VLOOKUP($B$1,Data!$A$2:$DH$292,52)),0,(VLOOKUP($B$1,Data!$A$2:$DH$292,52)))","v":0},{"$f":"IF(ISERROR(VLOOKUP($B$1,Data!$A$2:$DH$292,53)),0,(VLOOKUP($B$1,Data!$A$2:$DH$292,53)))","v":0},{"$f":"IF(ISERROR(VLOOKUP($B$1,Data!$A$2:$DH$292,54)),0,(VLOOKUP($B$1,Data!$A$2:$DH$292,54)))","v":0},{"$f":"IF(ISERROR(VLOOKUP($B$1,Data!$A$2:$DH$292,55)),0,(VLOOKUP($B$1,Data!$A$2:$DH$292,55)))","v":0},{"$f":"IF(ISERROR(VLOOKUP($B$1,Data!$A$2:$DH$292,56)),0,(VLOOKUP($B$1,Data!$A$2:$DH$292,56)))","v":0},{"$f":"C74+C75","v":0},{"$f":"D74+D75","v":0},{"$f":"E74+E75","v":0}]
["16-18 år, 5 år innan",{"$f":"IF(ISERROR(VLOOKUP($B$1,Data!$A$2:$DH$292,93)),0,(VLOOKUP($B$1,Data!$A$2:$DH$292,93)))","v":0},{"$f":"IF(ISERROR(VLOOKUP($B$1,Data!$A$2:$DH$292,94)),0,(VLOOKUP($B$1,Data!$A$2:$DH$292,94)))","v":0},{"$f":"IF(ISERROR(VLOOKUP($B$1,Data!$A$2:$DH$292,95)),0,(VLOOKUP($B$1,Data!$A$2:$DH$292,95)))","v":0},{"$f":"IF(ISERROR(VLOOKUP($B$1,Data!$A$2:$DH$292,96)),0,(VLOOKUP($B$1,Data!$A$2:$DH$292,96)))","v":0},{"$f":"IF(ISERROR(VLOOKUP($B$1,Data!$A$2:$DH$292,97)),0,(VLOOKUP($B$1,Data!$A$2:$DH$292,97)))","v":0},{"$f":"IF(ISERROR(VLOOKUP($B$1,Data!$A$2:$DH$292,98)),0,(VLOOKUP($B$1,Data!$A$2:$DH$292,98)))","v":0},{"$f":"C76","v":0},{"$f":"D76","v":0},{"$f":"E76","v":0}]
[]
["Antal invånare den 1.11"]
["Totalt 5 år innan",{"$f":"IF(ISERROR(VLOOKUP($B$1,Data!$A$2:$DH$292,63)),0,(VLOOKUP($B$1,Data!$A$2:$DH$292,63,0)))","v":0},{"$f":"IF(ISERROR(VLOOKUP($B$1,Data!$A$2:$DH$292,64)),0,(VLOOKUP($B$1,Data!$A$2:$DH$292,64,0)))","v":0},{"$f":"IF(ISERROR(VLOOKUP($B$1,Data!$A$2:$DH$292,65)),0,(VLOOKUP($B$1,Data!$A$2:$DH$292,65,0)))","v":0},{"$f":"IF(ISERROR(VLOOKUP($B$1,Data!$A$2:$DH$292,66)),0,(VLOOKUP($B$1,Data!$A$2:$DH$292,66,0)))","v":0},{"$f":"IF(ISERROR(VLOOKUP($B$1,Data!$A$2:$DH$292,67)),0,(VLOOKUP($B$1,Data!$A$2:$DH$292,67,0)))","v":0},{"$f":"C30","v":0},{"$f":"D30","v":0},{"$f":"E30","v":0},{"$f":"F30","v":0}]
[]
["Fastighetsavgift"]
["Fastigh.avg prognos nominellt tkr",{"$f":"(+IF(ISERROR(VLOOKUP(B1,Data!A2:DH292,92)),0,(VLOOKUP(B1,Data!A2:DH292,92)))*(1314.51821054614/1000))+(+IF(ISERROR(VLOOKUP(B1,Data!A2:DH292,88)),0,(VLOOKUP(B1,Data!A2:DH292,88))))","v":0},{"$f":"B91+IF(ISERROR(VLOOKUP(B1,Data!A2:DH292,89)),0,(VLOOKUP(B1,Data!A2:DH292,89)))","v":0},{"$f":"C91+IF(ISERROR(VLOOKUP(B1,Data!A2:DH292,90)),0,(VLOOKUP(B1,Data!A2:DH292,90)))","v":0},{"$f":"D91+IF(ISERROR(VLOOKUP(B1,Data!A2:ED292,91)),0,(VLOOKUP(B1,Data!A2:ED292,91)))","v":0},{"$f":"E91","v":0},{"$f":"F91","v":0},{"$f":"G91","v":0},{"$f":"H91","v":0},{"$f":"I91","v":0}]
["   Kr/Inv",{"$f":"(B91/IF($O$3=1,B$29,B$30))*1000","v":{"$error":"#DIV/0!"}},{"$error":"#DIV/0!"},{"$error":"#DIV/0!"},{"$error":"#DIV/0!"},{"$error":"#DIV/0!"},{"$error":"#DIV/0!"},{"$error":"#DIV/0!"},{"$error":"#DIV/0!"},{"$error":"#DIV/0!"}]
["Egen prognos (anges i tkr)",{"$f":"B91","v":0}]
["   Kr/Inv",{"$f":"B92","v":{"$error":"#DIV/0!"}},{"$f":"(C93/IF($O$3=1,C$29,C$30))*1000","v":{"$error":"#DIV/0!"}},{"$error":"#DIV/0!"},{"$error":"#DIV/0!"},{"$error":"#DIV/0!"},{"$error":"#DIV/0!"},{"$error":"#DIV/0!"},{"$error":"#DIV/0!"},{"$error":"#DIV/0!"}]
["Aktuell serie tkr",{"$f":"IF($X4=2,0,IF($X4=1,B91,IF($X4=3,B93)))","v":0},0,0,0,0,0,0,0,0]
["Aktuell serie kr/inv",{"$f":"IF($X4=2,0,IF($X4=1,B92,IF($X4=3,B94)))","v":{"$error":"#DIV/0!"}},{"$error":"#DIV/0!"},{"$error":"#DIV/0!"},{"$error":"#DIV/0!"},{"$error":"#DIV/0!"},{"$error":"#DIV/0!"},{"$error":"#DIV/0!"},{"$error":"#DIV/0!"},{"$error":"#DIV/0!"}]
[]
["Uppräkningsfaktorer värdesäkrat statsbidrag"]
["Prisindex för kommunal verksamhet (PKV)",{"$f":"B3","v":2023},2024,2025,2026,2027,2028,2029,2030,2031]
["Arbetskraftskostnader",6.7282091465600491,5.6735606997217136,-0.67136600092431165,2.2131281109112333,3.8036794864589218,3.8036794864589218,3.8036794864589218,3.8036794864589218,3.8036794864589218]
["Övrig förbrukning",3.8200000000000012,2.554571960351204,2.3650800761463309,2.4574728515820432,2.5200000000000111,2.5200000000000111,2.5200000000000111,2.5200000000000111,2.5200000000000111]
["Prisförändring",5.8138685156089664,4.7127080058800175,0.25170323266727745,2.2893261753980987,3.403014238728197,3.403014238728197,3.403014238728197,3.403014238728197,3.403014238728197]
[]
["Värdesäkrad skup"]
["Befolkning",null,{"$f":"C25","v":0.40859865109091359},0.24653138823465226,0.23247046640544763,0.2236830470892924,0.21140809908312069,0.2166498349996058,0.22090163869175508,0.227404615748342]
["PKV",null,{"$f":"C102","v":4.7127080058800175},0.25170323266727745,2.2893261753980987,3.403014238728197,3.403014238728197,3.403014238728197,3.403014238728197,3.403014238728197]
["Uppräkningsfaktor",null,{"$f":"(((C105/100+1)*(C106/100+1))-1)*100","v":5.1405627183128022},{"$f":"(((D105/100+1)*(D106/100+1))-1)*100","v":0.49885514837564315},2.5271186490410269,3.6343092517595599,3.6216165855249338,3.6270366984610281,3.6314331916382114,3.638157465929992]
[]
["Ersättning elever befolkningsförändringar"]
["1-5 år",null,null,15260.611655230156]
["6-15 år",null,null,18312.733986276187]
["16-18 år",null,null,18312.733986276187]

{"sheet":"Blad 3 Inkomstutjämning","index":6,"n_rows":51,"n_cols":10,"rows_kept":51,"cut":false,"hidden":true,"merged":[]}
["Inkomstutjämning",null,null,"Rikets skatteunderlag",null,{"$f":"IF('Blad 2 Indata'!$L$3=1,\"Kommunförbundet\",\"Egen prognos\")","v":"Kommunförbundet"}]
[]
["Kommunens skatte-",null,null,"Eget skatteunderlag",null,{"$f":"IF('Blad 2 Indata'!$N$3=1,\"Riksprognos\",\"Egen prognos\")","v":"Riksprognos"}]
["underlag inkomståret 2022, tkr",{"$f":"'Blad 2 Indata'!B20","v":0}]
[null,null,null,"Antal invånare",null,{"$f":"IF('Blad 2 Indata'!$O$3=1,\"Riksprognos\",\"Egen prognos\")","v":"Riksprognos"}]
[]
[null,{"$f":"'Blad 1 Totala intäkter'!B9-1","v":2023},{"$f":"B7+1","v":2024},2025,2026,2027,2028,2029,2030,2031]
[]
["Uppräkningsfaktorer, %"]
[{"$f":"\"Riket, fastställt för \"&C7","v":"Riket, fastställt för 2024"},{"$f":"'Blad 2 Indata'!B7","v":4.5999999999999996},{"$f":"'Blad 2 Indata'!C7","v":3.3}]
[{"$f":"\"Riket, fastställt för \"&D7","v":"Riket, fastställt för 2025"},null,{"$f":"'Blad 2 Indata'!C8","v":0},{"$f":"'Blad 2 Indata'!D8","v":0}]
["Riksprognos",{"$f":"IF('Blad 2 Indata'!$L3=1,'Blad 2 Indata'!B9,'Blad 2 Indata'!B10)","v":5.0943595873486291},{"$f":"IF('Blad 2 Indata'!$L3=1,'Blad 2 Indata'!C9,'Blad 2 Indata'!C10)","v":2.8500526395127901},{"$f":"IF('Blad 2 Indata'!$L3=1,'Blad 2 Indata'!D9,'Blad 2 Indata'!D10)","v":4.758554999090614},{"$f":"IF('Blad 2 Indata'!$L3=1,'Blad 2 Indata'!E9,'Blad 2 Indata'!E10)","v":4.1273943366828991},{"$f":"IF('Blad 2 Indata'!$L3=1,'Blad 2 Indata'!F9,'Blad 2 Indata'!F10)","v":4.0119628964820242},{"$f":"IF('Blad 2 Indata'!$L3=1,'Blad 2 Indata'!G9,'Blad 2 Indata'!G10)","v":4.0813872004546337},{"$f":"IF('Blad 2 Indata'!$L3=1,'Blad 2 Indata'!H9,'Blad 2 Indata'!H10)","v":3.3005944829045397},{"$f":"IF('Blad 2 Indata'!$L3=1,'Blad 2 Indata'!I9,'Blad 2 Indata'!I10)","v":3.7130154970406171},{"$f":"IF('Blad 2 Indata'!$L3=1,'Blad 2 Indata'!J9,'Blad 2 Indata'!J10)","v":3.6633313430403325}]
["Eget skatteunderlag",{"$f":"IF('Blad 2 Indata'!$N3=1,'Blad 2 Indata'!B14,'Blad 2 Indata'!B15)","v":5.0943595873486291},{"$f":"IF('Blad 2 Indata'!$N3=1,'Blad 2 Indata'!C14,'Blad 2 Indata'!C15)","v":2.8500526395127901},{"$f":"IF('Blad 2 Indata'!$N3=1,'Blad 2 Indata'!D14,'Blad 2 Indata'!D15)","v":4.758554999090614},{"$f":"IF('Blad 2 Indata'!$N3=1,'Blad 2 Indata'!E14,'Blad 2 Indata'!E15)","v":4.1273943366828991},{"$f":"IF('Blad 2 Indata'!$N3=1,'Blad 2 Indata'!F14,'Blad 2 Indata'!F15)","v":4.0119628964820242},{"$f":"IF('Blad 2 Indata'!$N3=1,'Blad 2 Indata'!G14,'Blad 2 Indata'!G15)","v":4.0813872004546337},{"$f":"IF('Blad 2 Indata'!$N3=1,'Blad 2 Indata'!H14,'Blad 2 Indata'!H15)","v":3.3005944829045397},{"$f":"IF('Blad 2 Indata'!$N3=1,'Blad 2 Indata'!I14,'Blad 2 Indata'!I15)","v":3.7130154970406171},{"$f":"IF('Blad 2 Indata'!$N3=1,'Blad 2 Indata'!J14,'Blad 2 Indata'!J15)","v":3.6633313430403325}]
[]
["Medelskattekraft, kr/inv"]
[{"$f":"\"Fastställt för \"&C7&\" och \"&D7","v":"Fastställt för 2024 och 2025"},260928,{"$f":"ROUND('Blad 2 Indata'!B19*1000000*(1+'Blad 2 Indata'!B7/100)*(1+'Blad 2 Indata'!C7/100)/'Blad 2 Indata'!C26,0)","v":270753},{"$f":"IF(D11<>0,ROUND('Blad 2 Indata'!B19*1000000*(1+'Blad 3 Inkomstutjämning'!B12/100)*(1+'Blad 3 Inkomstutjämning'!C11/100)*(1+'Blad 3 Inkomstutjämning'!D11/100)/'Blad 2 Indata'!D26,0),0)","v":0}]
["Prognos",{"$f":"ROUND('Blad 2 Indata'!$B19*1000000*PRODUCT($B$51:B51)/'Blad 2 Indata'!B26,0)","v":264418},{"$f":"ROUND('Blad 2 Indata'!$B19*1000000*PRODUCT($B$51:C51)/'Blad 2 Indata'!C26,0)","v":270848},{"$f":"ROUND('Blad 2 Indata'!$B19*1000000*PRODUCT($B$51:D51)/'Blad 2 Indata'!D26,0)","v":283038},{"$f":"ROUND('Blad 2 Indata'!$B19*1000000*PRODUCT($B$51:E51)/'Blad 2 Indata'!E26,0)","v":294037},{"$f":"ROUND('Blad 2 Indata'!$B19*1000000*PRODUCT($B$51:F51)/'Blad 2 Indata'!F26,0)","v":305151},{"$f":"ROUND('Blad 2 Indata'!$B19*1000000*PRODUCT($B$51:G51)/'Blad 2 Indata'!G26,0)","v":316935},{"$f":"ROUND('Blad 2 Indata'!$B19*1000000*PRODUCT($B$51:H51)/'Blad 2 Indata'!H26,0)","v":326688},{"$f":"ROUND('Blad 2 Indata'!$B19*1000000*PRODUCT($B$51:I51)/'Blad 2 Indata'!I26,0)","v":338072},{"$f":"ROUND('Blad 2 Indata'!$B19*1000000*PRODUCT($B$51:J51)/'Blad 2 Indata'!J26,0)","v":349661}]
[]
["Garanterad skattekraft, riket",null,{"$f":"IF(C16>0,C16*'Blad 2 Indata'!C53,C17*'Blad 2 Indata'!C53)","v":311365.94999999995},{"$f":"IF(D16>0,D16*'Blad 2 Indata'!D53,D17*'Blad 2 Indata'!D53)","v":325493.69999999995},{"$f":"(E17*'Blad 2 Indata'!E53)","v":338142.55},{"$f":"F17*'Blad 2 Indata'!F53","v":350923.64999999997},{"$f":"G17*'Blad 2 Indata'!G53","v":364475.25},{"$f":"H17*'Blad 2 Indata'!H53","v":375691.19999999995},{"$f":"I17*'Blad 2 Indata'!I53","v":388782.8},{"$f":"J17*'Blad 2 Indata'!J53","v":402110.14999999997}]
[]
["Antal invånare 1/11 året innan",null,{"$f":"'Blad 2 Indata'!C29","v":0},{"$f":"IF('Blad 2 Indata'!$O$3=1,'Blad 2 Indata'!D29,'Blad 2 Indata'!D30)","v":0},{"$f":"IF('Blad 2 Indata'!$O$3=1,'Blad 2 Indata'!E29,'Blad 2 Indata'!E30)","v":0},{"$f":"IF('Blad 2 Indata'!$O$3=1,'Blad 2 Indata'!F29,'Blad 2 Indata'!F30)","v":0},{"$f":"IF('Blad 2 Indata'!$O$3=1,'Blad 2 Indata'!G29,'Blad 2 Indata'!G30)","v":0},{"$f":"IF('Blad 2 Indata'!$O$3=1,'Blad 2 Indata'!H29,'Blad 2 Indata'!H30)","v":0},{"$f":"IF('Blad 2 Indata'!$O$3=1,'Blad 2 Indata'!I29,'Blad 2 Indata'!I30)","v":0},{"$f":"IF('Blad 2 Indata'!$O$3=1,'Blad 2 Indata'!J29,'Blad 2 Indata'!J30)","v":0}]
[]
[]
["Skatteutjämningsunderlag, tkr",null,{"$f":"(ROUND($B$4*1000*(1+B10/100)*(1+C10/100),0)/1000)","v":0},{"$f":"IF(C11<>0,ROUND($B$4*1000*(1+B13/100)*(1+C11/100)*(1+D11/100),0)/1000,ROUND($B$4*1000*(1+B13/100)*(1+C12/100)*(1+D12/100),0)/1000)","v":0},{"$f":"ROUND($B$4*1000*(1+B13/100)*(1+C13/100)*(1+D12/100)*(1+E12/100),0)/1000","v":0},{"$f":"ROUND($B$4*1000*(1+B13/100)*(1+C13/100)*(1+D13/100)*(1+E12/100)*(1+F12/100),0)/1000","v":0},{"$f":"ROUND($B$4*1000*(1+B13/100)*(1+C13/100)*(1+D13/100)*(1+E13/100)*(1+F12/100)*(1+G12/100),0)/1000","v":0},{"$f":"ROUND($B$4*1000*(1+B13/100)*(1+C13/100)*(1+D13/100)*(1+E13/100)*(1+F13/100)*(1+G12/100)*(1+H12/100),0)/1000","v":0},{"$f":"ROUND($B$4*1000*(1+B13/100)*(1+C13/100)*(1+D13/100)*(1+E13/100)*(1+F13/100)*(1+G13/100)*(1+H12/100)*(1+I12/100),0)/1000","v":0},{"$f":"ROUND($B$4*1000*(1+B13/100)*(1+C13/100)*(1+D13/100)*(1+E13/100)*(1+F13/100)*(1+G13/100)*(1+H13/100)*(1+I12/100)*(1+J12/100),0)/1000","v":0}]
[]
[]
["Garanterat skatteunderlag, tkr",null,{"$f":"ROUND(C19*C21,3)/1000","v":0},{"$f":"ROUND(IF(D16>0,(D16*'Blad 2 Indata'!D53*D21)/1000,(D17*'Blad 2 Indata'!D53*D21)/1000),3)","v":0},{"$f":"ROUND((E17*'Blad 2 Indata'!E53*E21)/1000,3)","v":0},{"$f":"ROUND((F17*'Blad 2 Indata'!F53*F21)/1000,3)","v":0},{"$f":"ROUND((G17*'Blad 2 Indata'!G53*G21)/1000,3)","v":0},{"$f":"ROUND((H17*'Blad 2 Indata'!H53*H21)/1000,3)","v":0},{"$f":"ROUND((I17*'Blad 2 Indata'!I53*I21)/1000,3)","v":0},{"$f":"ROUND((J17*'Blad 2 Indata'!J53*J21)/1000,3)","v":0}]
[]
[]
["Underlag för inkomstutjämning, tkr",null,{"$f":"C27-C24","v":0},0,0,0,0,0,0,0]
[]
[]
["Kommunen "]
["Skattekraft, kr/inv",null,{"$f":"IF(ISERROR(ROUND(((($B$4*1000*(1+B10/100)*(1+C10/100)/1000)/C21)*1000),0)),0,(ROUND(((($B$4*1000*(1+B10/100)*(1+C10/100)/1000)/C21)*1000),0)))","v":0},{"$f":"IF(D21=0,0,ROUND($B4*1000*PRODUCT($B$50:B50)*PRODUCT(C49:D49)/D21,0))","v":0},{"$f":"IF(E21=0,0,ROUND($B4*1000*PRODUCT($B$50:C50)*PRODUCT(D51:E51)/E21,0))","v":0},{"$f":"IF(F21=0,0,ROUND($B4*1000*PRODUCT($B$50:D50)*PRODUCT(E49:F49)/F21,0))","v":0},{"$f":"IF(G21=0,0,ROUND($B4*1000*PRODUCT($B$50:E50)*PRODUCT(F49:G49)/G21,0))","v":0},{"$f":"IF(H21=0,0,ROUND($B4*1000*PRODUCT($B$50:F50)*PRODUCT(G49:H49)/H21,0))","v":0},{"$f":"IF(I21=0,0,ROUND($B4*1000*PRODUCT($B$50:G50)*PRODUCT(H49:I49)/I21,0))","v":0},{"$f":"IF(J21=0,0,ROUND($B4*1000*PRODUCT($B$50:H50)*PRODUCT(I49:J49)/J21,0))","v":0}]
["Skattekraft i procent av rikets",null,{"$f":"IF(C16=0,(C34/C17),(C34/C16))","v":0},{"$f":"IF(D16=0,(D34/D17),(D34/D16))","v":0},{"$f":"+E34/E17","v":0},0,0,0,0,0]
[]
["Länsvis skattesats avgift 85%/bidrag 95%",null,{"$f":"IF(C34<C19,'Blad 2 Indata'!C61,'Blad 2 Indata'!C62)","v":0},{"$f":"IF(D34<D19,'Blad 2 Indata'!D61,'Blad 2 Indata'!D62)","v":0},{"$f":"IF(E34<E19,'Blad 2 Indata'!E61,'Blad 2 Indata'!E62)","v":0},{"$f":"IF(F34<F19,'Blad 2 Indata'!F61,'Blad 2 Indata'!F62)","v":0},{"$f":"IF(G34<G19,'Blad 2 Indata'!G61,'Blad 2 Indata'!G62)","v":0},{"$f":"IF(H34<H19,'Blad 2 Indata'!H61,'Blad 2 Indata'!H62)","v":0},{"$f":"IF(I34<I19,'Blad 2 Indata'!I61,'Blad 2 Indata'!I62)","v":0},{"$f":"IF(J34<J19,'Blad 2 Indata'!J61,'Blad 2 Indata'!J62)","v":0}]
[]
[]
["Inkomstutjämningsbidrag"]
["kronor per invånare",null,{"$f":"IF(C30<0,0,IF(ISERROR(ROUND(ROUND(C30*1000*C37/100,0)/C21,0)),0,ROUND(ROUND(C30*1000*C37/100,0)/C21,0)))","v":0},0,0,0,0,0,0,0]
["tkr",null,{"$f":"C41*C21/1000","v":0},0,0,0,0,0,0,0]
[]
["Inkomstutjämningsavgift"]
["kronor per invånare",null,{"$f":"IF(C30>0,0,IF(ISERROR(ROUND(ROUND(C30*1000*C37/100,0)/C21,0)),0,ROUND(ROUND(C30*1000*C37/100,0)/C21,0)))","v":0},{"$f":"IF(D30>0,0,IF(ISERROR(ROUND(ROUND(D30*1000*D37/100,0)/D21,0)),0,ROUND(ROUND(D30*1000*D37/100,0)/D21,0)))","v":0},0,0,{"$f":"IF(G30>0,0,IF(ISERROR(ROUND(ROUND(G30*1000*G37/100,0)/G21,0)),0,ROUND(ROUND(G30*1000*G37/100,0)/G21,0)))","v":0},0,0,0]
["tkr",null,{"$f":"ROUND(C45,0)*C21/1000","v":0},{"$f":"ROUND(D45,0)*D21/1000","v":0},0,0,0,0,0,0]
[]
["Skatteunderlag"]
["Riket",{"$f":"1+(B12/100)","v":1.0509435958734863},{"$f":"IF(C11>0,1+C11/100,1+(C12/100))","v":1.0285005263951279},{"$f":"IF(D11>0,1+D11/100,1+(D12/100))","v":1.0475855499909061},{"$f":"1+(E12/100)","v":1.041273943366829},1.0401196289648202,1.0408138720045463,1.0330059448290454,1.0371301549704062,1.0366333134304033]
["Kommunen",{"$f":"1+(B13/100)","v":1.0509435958734863},1.0285005263951279,1.0475855499909061,1.041273943366829,1.0401196289648202,1.0408138720045463,1.0330059448290454,1.0371301549704062,1.0366333134304033]
["Riket, utan fastställda",{"$f":"1+B12/100","v":1.0509435958734863},1.0285005263951279,1.0475855499909061,1.041273943366829,1.0401196289648202,1.0408138720045463,1.0330059448290454,1.0371301549704062,1.0366333134304033]

{"sheet":"Blad 4 Kostnadsutjämning","index":7,"n_rows":79,"n_cols":9,"rows_kept":79,"cut":false,"hidden":true,"merged":[]}
["Kostnadsutjämning",null,{"$f":"IF('Blad 2 Indata'!$P$5=1,\"Senaste utfall utan pris\",IF('Blad 2 Indata'!$P$5=2,\"Senaste utfall med pris\",IF('Blad 2 Indata'!$P$5=3,\"Demografi utan pris\",\"Demografi med pris\")))","v":"Senaste utfall utan pris"}]
["Kronor per invånare"]
[]
[]
[null,{"$f":"'Blad 1 Totala intäkter'!B9","v":2024},{"$f":"B5+1","v":2025},2026,2027,2028,2029,2030,2031]
["Bidrag/avgift totalt",{"$f":"'Blad 2 Indata'!C65","v":0},{"$f":"IF('Blad 2 Indata'!D65=0,IF('Blad 2 Indata'!$P$5=2,('Blad 2 Indata'!C65-'Blad 6 Befolkningsförändringar'!C110)*(1+(C8/100)),IF('Blad 2 Indata'!$P$5=3,B6+(C17),IF('Blad 2 Indata'!$P$5=4,((B6+C11+C12+C13+C14)*(1+(C8/100)))+C15,'Blad 2 Indata'!C65-'Blad 6 Befolkningsförändringar'!C110))),'Blad 2 Indata'!D65)","v":0},{"$f":"IF('Blad 2 Indata'!E65=0,IF('Blad 2 Indata'!$P$5=2,C6*(1+(D8/100)),IF('Blad 2 Indata'!$P$5=3,C6+(D17),IF('Blad 2 Indata'!$P$5=4,((C6+D11+D12+D13+D14)*(1+D8/100))+D15,C6))),'Blad 2 Indata'!D65)","v":0},{"$f":"IF('Blad 2 Indata'!F65=0,IF('Blad 2 Indata'!$P$5=2,D6*(1+(E8/100)),IF('Blad 2 Indata'!$P$5=3,D6+(E17),IF('Blad 2 Indata'!$P$5=4,((D6+E11+E12+E13+E14)*(1+E8/100))+E15,D6))),'Blad 2 Indata'!E65)","v":0},{"$f":"IF('Blad 2 Indata'!G65=0,IF('Blad 2 Indata'!$P$5=2,E6*(1+(F8/100)),IF('Blad 2 Indata'!$P$5=3,E6+(F17),IF('Blad 2 Indata'!$P$5=4,((E6+F11+F12+F13+F14)*(1+F8/100))+F15,E6))),'Blad 2 Indata'!F65)","v":0},{"$f":"IF('Blad 2 Indata'!H65=0,IF('Blad 2 Indata'!$P$5=2,F6*(1+(G8/100)),IF('Blad 2 Indata'!$P$5=3,F6+(G17),IF('Blad 2 Indata'!$P$5=4,((F6+G11+G12+G13+G14)*(1+G8/100))+G15,F6))),'Blad 2 Indata'!G65)","v":0},{"$f":"IF('Blad 2 Indata'!I65=0,IF('Blad 2 Indata'!$P$5=2,G6*(1+(H8/100)),IF('Blad 2 Indata'!$P$5=3,G6+(H17),IF('Blad 2 Indata'!$P$5=4,((G6+H11+H12+H13+H14)*(1+H8/100))+H15,G6))),'Blad 2 Indata'!H65)","v":0},{"$f":"IF('Blad 2 Indata'!J65=0,IF('Blad 2 Indata'!$P$5=2,H6*(1+(I8/100)),IF('Blad 2 Indata'!$P$5=3,H6+(I17),IF('Blad 2 Indata'!$P$5=4,((H6+I11+I12+I13+I14)*(1+I8/100))+I15,H6))),'Blad 2 Indata'!I65)","v":0}]
[]
["Kpi, procent",null,{"$f":"'Blad 2 Indata'!D56","v":0.4488786213272089},{"$f":"'Blad 2 Indata'!E56","v":1.6619440856880718},{"$f":"'Blad 2 Indata'!F56","v":2.1080328909825363},{"$f":"'Blad 2 Indata'!G56","v":2.1727128377435401},{"$f":"'Blad 2 Indata'!H56","v":2.1384508973766758},{"$f":"'Blad 2 Indata'!I56","v":2.0995805511258014},{"$f":"'Blad 2 Indata'!J56","v":2.0995805511258014}]
[]
["förändring inom"]
["Barnomsorg inkl befolkningsförändr",null,{"$f":"IF(C24=0,0,(((B$23-C$23)-(B$24-C$24))/100*C57+((B$27-C$27)-(B$28-C$28))/100*C58)+'Blad 6 Befolkningsförändringar'!D48-'Blad 6 Befolkningsförändringar'!C48+'Blad 6 Befolkningsförändringar'!D67-'Blad 6 Befolkningsförändringar'!C67)","v":0},{"$f":"IF(D24=0,0,(((C$23-D$23)-(C$24-D$24))/100*D57+((C$27-D$27)-(C$28-D$28))/100*D58)+'Blad 6 Befolkningsförändringar'!E48-'Blad 6 Befolkningsförändringar'!D48+'Blad 6 Befolkningsförändringar'!E67-'Blad 6 Befolkningsförändringar'!D67)","v":0},{"$f":"IF(E24=0,0,(((D$23-E$23)-(D$24-E$24))/100*E57+((D$27-E$27)-(D$28-E$28))/100*E58)+'Blad 6 Befolkningsförändringar'!F48-'Blad 6 Befolkningsförändringar'!E48+'Blad 6 Befolkningsförändringar'!F67-'Blad 6 Befolkningsförändringar'!E67)","v":0},{"$f":"IF(F24=0,0,(((E$23-F$23)-(E$24-F$24))/100*F57+((E$27-F$27)-(E$28-F$28))/100*F58)+'Blad 6 Befolkningsförändringar'!G48-'Blad 6 Befolkningsförändringar'!F48+'Blad 6 Befolkningsförändringar'!G67-'Blad 6 Befolkningsförändringar'!F67)","v":0},{"$f":"IF(G24=0,0,(((F$23-G$23)-(F$24-G$24))/100*G57+((F$27-G$27)-(F$28-G$28))/100*G58)+'Blad 6 Befolkningsförändringar'!H48-'Blad 6 Befolkningsförändringar'!G48+'Blad 6 Befolkningsförändringar'!H67-'Blad 6 Befolkningsförändringar'!G67)","v":0},{"$f":"IF(H24=0,0,(((G$23-H$23)-(G$24-H$24))/100*H57+((G$27-H$27)-(G$28-H$28))/100*H58)+'Blad 6 Befolkningsförändringar'!I48-'Blad 6 Befolkningsförändringar'!H48+'Blad 6 Befolkningsförändringar'!I67-'Blad 6 Befolkningsförändringar'!H67)","v":0},{"$f":"IF(I24=0,0,(((H$23-I$23)-(H$24-I$24))/100*I57+((H$27-I$27)-(H$28-I$28))/100*I58)+'Blad 6 Befolkningsförändringar'!J48-'Blad 6 Befolkningsförändringar'!I48+'Blad 6 Befolkningsförändringar'!J67-'Blad 6 Befolkningsförändringar'!I67)","v":0}]
["Grundskola inkl befolkningsförändr",null,{"$f":"IF(C$36=0,0,(((B$31-C$31)-(B$32-C$32))/100*C59+((B$35-C$35)-(B$36-C$36))/100*C60)+'Blad 6 Befolkningsförändringar'!D52-'Blad 6 Befolkningsförändringar'!C52+'Blad 6 Befolkningsförändringar'!D71-'Blad 6 Befolkningsförändringar'!C71)","v":0},{"$f":"IF(D$36=0,0,(((C$31-D$31)-(C$32-D$32))/100*D59+((C$35-D$35)-(C$36-D$36))/100*D60)+'Blad 6 Befolkningsförändringar'!E52-'Blad 6 Befolkningsförändringar'!D52+'Blad 6 Befolkningsförändringar'!E71-'Blad 6 Befolkningsförändringar'!D71)","v":0},{"$f":"IF(E$36=0,0,(((D$31-E$31)-(D$32-E$32))/100*E59+((D$35-E$35)-(D$36-E$36))/100*E60)+'Blad 6 Befolkningsförändringar'!F52-'Blad 6 Befolkningsförändringar'!E52+'Blad 6 Befolkningsförändringar'!F71-'Blad 6 Befolkningsförändringar'!E71)","v":0},{"$f":"IF(F$36=0,0,(((E$31-F$31)-(E$32-F$32))/100*F59+((E$35-F$35)-(E$36-F$36))/100*F60)+'Blad 6 Befolkningsförändringar'!G52-'Blad 6 Befolkningsförändringar'!F52+'Blad 6 Befolkningsförändringar'!G71-'Blad 6 Befolkningsförändringar'!F71)","v":0},{"$f":"IF(G$36=0,0,(((F$31-G$31)-(F$32-G$32))/100*G59+((F$35-G$35)-(F$36-G$36))/100*G60)+'Blad 6 Befolkningsförändringar'!H52-'Blad 6 Befolkningsförändringar'!G52+'Blad 6 Befolkningsförändringar'!H71-'Blad 6 Befolkningsförändringar'!G71)","v":0},{"$f":"IF(H$36=0,0,(((G$31-H$31)-(G$32-H$32))/100*H59+((G$35-H$35)-(G$36-H$36))/100*H60)+'Blad 6 Befolkningsförändringar'!I52-'Blad 6 Befolkningsförändringar'!H52+'Blad 6 Befolkningsförändringar'!I71-'Blad 6 Befolkningsförändringar'!H71)","v":0},{"$f":"IF(I$36=0,0,(((H$31-I$31)-(H$32-I$32))/100*I59+((H$35-I$35)-(H$36-I$36))/100*I60)+'Blad 6 Befolkningsförändringar'!J52-'Blad 6 Befolkningsförändringar'!I52+'Blad 6 Befolkningsförändringar'!J71-'Blad 6 Befolkningsförändringar'!I71)","v":0}]
["Gymnasieskola inkl befolkningsförändr",null,{"$f":"IF(C$40=0,0,(((B$39-C$39)-(B$40-C$40))/100*C61)+'Blad 6 Befolkningsförändringar'!D56-'Blad 6 Befolkningsförändringar'!C56+'Blad 6 Befolkningsförändringar'!D75-'Blad 6 Befolkningsförändringar'!C75)","v":0},{"$f":"IF(D$40=0,0,(((C$39-D$39)-(C$40-D$40))/100*D61)+'Blad 6 Befolkningsförändringar'!E56-'Blad 6 Befolkningsförändringar'!D56+'Blad 6 Befolkningsförändringar'!E75-'Blad 6 Befolkningsförändringar'!D75)","v":0},{"$f":"IF(E$40=0,0,(((D$39-E$39)-(D$40-E$40))/100*E61)+'Blad 6 Befolkningsförändringar'!F56-'Blad 6 Befolkningsförändringar'!E56+'Blad 6 Befolkningsförändringar'!F75-'Blad 6 Befolkningsförändringar'!E75)","v":0},{"$f":"IF(F$40=0,0,(((E$39-F$39)-(E$40-F$40))/100*F61)+'Blad 6 Befolkningsförändringar'!G56-'Blad 6 Befolkningsförändringar'!F56+'Blad 6 Befolkningsförändringar'!G75-'Blad 6 Befolkningsförändringar'!F75)","v":0},{"$f":"IF(G$40=0,0,(((F$39-G$39)-(F$40-G$40))/100*G61)+'Blad 6 Befolkningsförändringar'!H56-'Blad 6 Befolkningsförändringar'!G56+'Blad 6 Befolkningsförändringar'!H75-'Blad 6 Befolkningsförändringar'!G75)","v":0},{"$f":"IF(H$40=0,0,(((G$39-H$39)-(G$40-H$40))/100*H61)+'Blad 6 Befolkningsförändringar'!I56-'Blad 6 Befolkningsförändringar'!H56+'Blad 6 Befolkningsförändringar'!I75-'Blad 6 Befolkningsförändringar'!H75)","v":0},{"$f":"IF(I$40=0,0,(((H$39-I$39)-(H$40-I$40))/100*I61)+'Blad 6 Befolkningsförändringar'!J56-'Blad 6 Befolkningsförändringar'!I56+'Blad 6 Befolkningsförändringar'!J75-'Blad 6 Befolkningsförändringar'!I75)","v":0}]
["Äldreomsorg",null,{"$f":"IF(C$44=0,0,(((B$43-C$43)-(B$44-C$44))/100*C62+((B$47-C$47)-(B$48-C$48))/100*C63+((B$51-C$51)-(B$52-C$52))/100*C64))","v":0},0,0,0,0,0,0]
["Verksamhetsövergr befolkningsförändr (minskning totalt, eftersläp)",null,{"$f":"IF('Blad 2 Indata'!C71<>0,('Blad 6 Befolkningsförändringar'!D11-'Blad 6 Befolkningsförändringar'!C11)+('Blad 6 Befolkningsförändringar'!D110-'Blad 6 Befolkningsförändringar'!C110),IF('Blad 2 Indata'!$P$5>2,('Blad 6 Befolkningsförändringar'!D110-'Blad 6 Befolkningsförändringar'!C110),0))","v":0},{"$f":"IF('Blad 2 Indata'!D71<>0,('Blad 6 Befolkningsförändringar'!E11-'Blad 6 Befolkningsförändringar'!D11)+('Blad 6 Befolkningsförändringar'!E110-'Blad 6 Befolkningsförändringar'!D110),IF('Blad 2 Indata'!$P$5>2,('Blad 6 Befolkningsförändringar'!E110-'Blad 6 Befolkningsförändringar'!D110),0))","v":0},{"$f":"IF('Blad 2 Indata'!E71<>0,('Blad 6 Befolkningsförändringar'!F11-'Blad 6 Befolkningsförändringar'!E11)+('Blad 6 Befolkningsförändringar'!F110-'Blad 6 Befolkningsförändringar'!E110),IF('Blad 2 Indata'!$P$5>2,('Blad 6 Befolkningsförändringar'!F110-'Blad 6 Befolkningsförändringar'!E110),0))","v":0},{"$f":"IF('Blad 2 Indata'!F71<>0,('Blad 6 Befolkningsförändringar'!G11-'Blad 6 Befolkningsförändringar'!F11)+('Blad 6 Befolkningsförändringar'!G110-'Blad 6 Befolkningsförändringar'!F110),IF('Blad 2 Indata'!$P$5>2,('Blad 6 Befolkningsförändringar'!G110-'Blad 6 Befolkningsförändringar'!F110),0))","v":0},{"$f":"IF('Blad 2 Indata'!G71<>0,('Blad 6 Befolkningsförändringar'!H11-'Blad 6 Befolkningsförändringar'!G11)+('Blad 6 Befolkningsförändringar'!H110-'Blad 6 Befolkningsförändringar'!G110),IF('Blad 2 Indata'!$P$5>2,('Blad 6 Befolkningsförändringar'!H110-'Blad 6 Befolkningsförändringar'!G110),0))","v":0},{"$f":"IF('Blad 2 Indata'!H71<>0,('Blad 6 Befolkningsförändringar'!I11-'Blad 6 Befolkningsförändringar'!H11)+('Blad 6 Befolkningsförändringar'!I110-'Blad 6 Befolkningsförändringar'!H110),IF('Blad 2 Indata'!$P$5>2,('Blad 6 Befolkningsförändringar'!I110-'Blad 6 Befolkningsförändringar'!H110),0))","v":0},{"$f":"IF('Blad 2 Indata'!I71<>0,('Blad 6 Befolkningsförändringar'!J11-'Blad 6 Befolkningsförändringar'!I11)+('Blad 6 Befolkningsförändringar'!J110-'Blad 6 Befolkningsförändringar'!I110),IF('Blad 2 Indata'!$P$5>2,('Blad 6 Befolkningsförändringar'!J110-'Blad 6 Befolkningsförändringar'!I110),0))","v":0}]
["  därav eftersläpningseffekter",null,{"$f":"IF('Blad 2 Indata'!C71<>0,'Blad 6 Befolkningsförändringar'!D110-'Blad 6 Befolkningsförändringar'!C110,(IF('Blad 2 Indata'!$P$5>2,('Blad 6 Befolkningsförändringar'!D110-'Blad 6 Befolkningsförändringar'!C110),0)))","v":0},{"$f":"IF('Blad 2 Indata'!D71<>0,'Blad 6 Befolkningsförändringar'!E110-'Blad 6 Befolkningsförändringar'!D110,(IF('Blad 2 Indata'!$P5>2,('Blad 6 Befolkningsförändringar'!E110-'Blad 6 Befolkningsförändringar'!D110),0)))","v":0},{"$f":"IF('Blad 2 Indata'!E71<>0,'Blad 6 Befolkningsförändringar'!F110-'Blad 6 Befolkningsförändringar'!E110,(IF('Blad 2 Indata'!$P5>2,('Blad 6 Befolkningsförändringar'!F110-'Blad 6 Befolkningsförändringar'!E110),0)))","v":0},{"$f":"IF('Blad 2 Indata'!F71<>0,'Blad 6 Befolkningsförändringar'!G110-'Blad 6 Befolkningsförändringar'!F110,(IF('Blad 2 Indata'!$P5>2,('Blad 6 Befolkningsförändringar'!G110-'Blad 6 Befolkningsförändringar'!F110),0)))","v":0},{"$f":"IF('Blad 2 Indata'!G71<>0,'Blad 6 Befolkningsförändringar'!H110-'Blad 6 Befolkningsförändringar'!G110,(IF('Blad 2 Indata'!$P5>2,('Blad 6 Befolkningsförändringar'!H110-'Blad 6 Befolkningsförändringar'!G110),0)))","v":0},{"$f":"IF('Blad 2 Indata'!H71<>0,'Blad 6 Befolkningsförändringar'!I110-'Blad 6 Befolkningsförändringar'!H110,(IF('Blad 2 Indata'!$P5>2,('Blad 6 Befolkningsförändringar'!I110-'Blad 6 Befolkningsförändringar'!H110),0)))","v":0},{"$f":"IF('Blad 2 Indata'!I71<>0,'Blad 6 Befolkningsförändringar'!J110-'Blad 6 Befolkningsförändringar'!I110,(IF('Blad 2 Indata'!$P5>2,('Blad 6 Befolkningsförändringar'!J110-'Blad 6 Befolkningsförändringar'!I110),0)))","v":0}]
["Totalt",null,{"$f":"SUM(C11:C15)","v":0},{"$f":"SUM(D11:D15)","v":0},0,0,0,0,0]
[]
["Andel av totalbefolkning"]
["den 31.12 året innan"]
[]
["Andel 1-5 år"]
["   riket",{"$f":"B71/B$79*100","v":5.4727922221494589},5.2889658640992581,5.1097072241803909,4.9363327362458929,4.7522136941481845,4.6505103283868525,4.6039348361600707,4.5915020866266056]
["   kommunen",{"$f":"IF('Blad 2 Indata'!B72>0,'Blad 2 Indata'!B72/'Blad 2 Indata'!B$71*100,0)","v":0},{"$f":"IF('Blad 2 Indata'!C72>0,'Blad 2 Indata'!C72/'Blad 2 Indata'!C$71*100,0)","v":0},{"$f":"IF('Blad 2 Indata'!D72>0,'Blad 2 Indata'!D72/'Blad 2 Indata'!D$71*100,0)","v":0},{"$f":"IF('Blad 2 Indata'!E72>0,'Blad 2 Indata'!E72/'Blad 2 Indata'!E$71*100,0)","v":0},{"$f":"IF('Blad 2 Indata'!F72>0,'Blad 2 Indata'!F72/'Blad 2 Indata'!F$71*100,0)","v":0},{"$f":"IF('Blad 2 Indata'!G72>0,'Blad 2 Indata'!G72/'Blad 2 Indata'!G$71*100,0)","v":0},{"$f":"IF('Blad 2 Indata'!H72>0,'Blad 2 Indata'!H72/'Blad 2 Indata'!H$71*100,0)","v":0},{"$f":"IF('Blad 2 Indata'!I72>0,'Blad 2 Indata'!I72/'Blad 2 Indata'!I$71*100,0)","v":0}]
[null,{"$f":"B24-B23","v":-5.4727922221494589},-5.2889658640992581,-5.1097072241803909,-4.9363327362458929,-4.7522136941481845,-4.6505103283868525,-4.6039348361600707,-4.5915020866266056]
["Andel 6-12 år"]
["   riket",{"$f":"B72/B$79*100","v":8.2402875667415714},8.1750604099938364,8.0883882851944531,8.0001121774029169,7.9165402794198991,7.7633073327610962,7.5519016405030541,7.3602902386361997]
["   kommunen",{"$f":"IF('Blad 2 Indata'!B73>0,'Blad 2 Indata'!B73/'Blad 2 Indata'!B$71*100,0)","v":0},{"$f":"IF('Blad 2 Indata'!C73>0,'Blad 2 Indata'!C73/'Blad 2 Indata'!C$71*100,0)","v":0},{"$f":"IF('Blad 2 Indata'!D73>0,'Blad 2 Indata'!D73/'Blad 2 Indata'!D$71*100,0)","v":0},{"$f":"IF('Blad 2 Indata'!E73>0,'Blad 2 Indata'!E73/'Blad 2 Indata'!E$71*100,0)","v":0},{"$f":"IF('Blad 2 Indata'!F73>0,'Blad 2 Indata'!F73/'Blad 2 Indata'!F$71*100,0)","v":0},{"$f":"IF('Blad 2 Indata'!G73>0,'Blad 2 Indata'!G73/'Blad 2 Indata'!G$71*100,0)","v":0},{"$f":"IF('Blad 2 Indata'!H73>0,'Blad 2 Indata'!H73/'Blad 2 Indata'!H$71*100,0)","v":0},{"$f":"IF('Blad 2 Indata'!I73>0,'Blad 2 Indata'!I73/'Blad 2 Indata'!I$71*100,0)","v":0}]
[null,{"$f":"B28-B27","v":-8.2402875667415714},-8.1750604099938364,-8.0883882851944531,-8.0001121774029169,-7.9165402794198991,-7.7633073327610962,-7.5519016405030541,-7.3602902386361997]
["Andel 6 år"]
["   riket",{"$f":"B73/B$79*100","v":1.1462505545311295},1.137513566250572,1.1141062655213818,1.0953107022324244,1.1014801159601033,1.0127760140035758,0.96843106407081947,0.94529059546404182]
["   kommunen",{"$f":"IF('Blad 2 Indata'!B74>0,'Blad 2 Indata'!B74/'Blad 2 Indata'!B$71*100,0)","v":0},{"$f":"IF('Blad 2 Indata'!C74>0,'Blad 2 Indata'!C74/'Blad 2 Indata'!C$71*100,0)","v":0},{"$f":"IF('Blad 2 Indata'!D74>0,'Blad 2 Indata'!D74/'Blad 2 Indata'!D$71*100,0)","v":0},{"$f":"IF('Blad 2 Indata'!E74>0,'Blad 2 Indata'!E74/'Blad 2 Indata'!E$71*100,0)","v":0},{"$f":"IF('Blad 2 Indata'!F74>0,'Blad 2 Indata'!F74/'Blad 2 Indata'!F$71*100,0)","v":0},{"$f":"IF('Blad 2 Indata'!G74>0,'Blad 2 Indata'!G74/'Blad 2 Indata'!G$71*100,0)","v":0},{"$f":"IF('Blad 2 Indata'!H74>0,'Blad 2 Indata'!H74/'Blad 2 Indata'!H$71*100,0)","v":0},{"$f":"IF('Blad 2 Indata'!I74>0,'Blad 2 Indata'!I74/'Blad 2 Indata'!I$71*100,0)","v":0}]
[null,{"$f":"B32-B31","v":-1.1462505545311295},-1.137513566250572,-1.1141062655213818,-1.0953107022324244,-1.1014801159601033,-1.0127760140035758,-0.96843106407081947,-0.94529059546404182]
["Andel 7-15 år"]
["   riket",{"$f":"B74/B$79*100","v":10.708371640721259},10.639920512170866,10.564914627095416,10.443019808157819,10.355017471960814,10.268742339451777,10.107082342306324,9.8974621377672651]
["   kommunen",{"$f":"IF('Blad 2 Indata'!B75>0,'Blad 2 Indata'!B75/'Blad 2 Indata'!B$71*100,0)","v":0},{"$f":"IF('Blad 2 Indata'!C75>0,'Blad 2 Indata'!C75/'Blad 2 Indata'!C$71*100,0)","v":0},{"$f":"IF('Blad 2 Indata'!D75>0,'Blad 2 Indata'!D75/'Blad 2 Indata'!D$71*100,0)","v":0},{"$f":"IF('Blad 2 Indata'!E75>0,'Blad 2 Indata'!E75/'Blad 2 Indata'!E$71*100,0)","v":0},{"$f":"IF('Blad 2 Indata'!F75>0,'Blad 2 Indata'!F75/'Blad 2 Indata'!F$71*100,0)","v":0},{"$f":"IF('Blad 2 Indata'!G75>0,'Blad 2 Indata'!G75/'Blad 2 Indata'!G$71*100,0)","v":0},{"$f":"IF('Blad 2 Indata'!H75>0,'Blad 2 Indata'!H75/'Blad 2 Indata'!H$71*100,0)","v":0},{"$f":"IF('Blad 2 Indata'!I75>0,'Blad 2 Indata'!I75/'Blad 2 Indata'!I$71*100,0)","v":0}]
[null,{"$f":"B36-B35","v":-10.708371640721259},-10.639920512170866,-10.564914627095416,-10.443019808157819,-10.355017471960814,-10.268742339451777,-10.107082342306324,-9.8974621377672651]
["Andel 16-18 år"]
["   riket",{"$f":"B75/B$79*100","v":3.4803657834699164},3.535204183888399,3.5644684979028152,3.6182670736924605,3.6103992209224027,3.6010573899223735,3.5508578013141308,3.553333634965584]
["   kommunen",{"$f":"IF('Blad 2 Indata'!B76>0,'Blad 2 Indata'!B76/'Blad 2 Indata'!B$71*100,0)","v":0},{"$f":"IF('Blad 2 Indata'!C76>0,'Blad 2 Indata'!C76/'Blad 2 Indata'!C$71*100,0)","v":0},{"$f":"IF('Blad 2 Indata'!D76>0,'Blad 2 Indata'!D76/'Blad 2 Indata'!D$71*100,0)","v":0},{"$f":"IF('Blad 2 Indata'!E76>0,'Blad 2 Indata'!E76/'Blad 2 Indata'!E$71*100,0)","v":0},{"$f":"IF('Blad 2 Indata'!F76>0,'Blad 2 Indata'!F76/'Blad 2 Indata'!F$71*100,0)","v":0},{"$f":"IF('Blad 2 Indata'!G76>0,'Blad 2 Indata'!G76/'Blad 2 Indata'!G$71*100,0)","v":0},{"$f":"IF('Blad 2 Indata'!H76>0,'Blad 2 Indata'!H76/'Blad 2 Indata'!H$71*100,0)","v":0},{"$f":"IF('Blad 2 Indata'!I76>0,'Blad 2 Indata'!I76/'Blad 2 Indata'!I$71*100,0)","v":0}]
[null,{"$f":"B40-B39","v":-3.4803657834699164},-3.535204183888399,-3.5644684979028152,-3.6182670736924605,-3.6103992209224027,-3.6010573899223735,-3.5508578013141308,-3.553333634965584]
["Andel 65-79"]
["   riket",{"$f":"B76/B$79*100","v":14.814626676043979},14.718710648419508,14.607910917526464,14.507813174934824,14.460735747509739,14.47703053724104,14.607147512130284,14.773484286281347]
["   kommunen",{"$f":"IF('Blad 2 Indata'!B77>0,'Blad 2 Indata'!B77/'Blad 2 Indata'!B$71*100,0)","v":0},{"$f":"IF('Blad 2 Indata'!C77>0,'Blad 2 Indata'!C77/'Blad 2 Indata'!C$71*100,0)","v":0},{"$f":"IF('Blad 2 Indata'!D77>0,'Blad 2 Indata'!D77/'Blad 2 Indata'!D$71*100,0)","v":0},{"$f":"IF('Blad 2 Indata'!E77>0,'Blad 2 Indata'!E77/'Blad 2 Indata'!E$71*100,0)","v":0},{"$f":"IF('Blad 2 Indata'!F77>0,'Blad 2 Indata'!F77/'Blad 2 Indata'!F$71*100,0)","v":0},{"$f":"IF('Blad 2 Indata'!G77>0,'Blad 2 Indata'!G77/'Blad 2 Indata'!G$71*100,0)","v":0},{"$f":"IF('Blad 2 Indata'!H77>0,'Blad 2 Indata'!H77/'Blad 2 Indata'!H$71*100,0)","v":0},{"$f":"IF('Blad 2 Indata'!I77>0,'Blad 2 Indata'!I77/'Blad 2 Indata'!I$71*100,0)","v":0}]
[null,{"$f":"B44-B43","v":-14.814626676043979},-14.718710648419508,-14.607910917526464,-14.507813174934824,-14.460735747509739,-14.47703053724104,-14.607147512130284,-14.773484286281347]
["Andel 80-89 "]
["   riket",{"$f":"B77/B$79*100","v":4.8226509701226545},5.1153273106113604,5.4050202267241758,5.6722428497728128,5.911194920594375,6.1125833523870927,6.2618196275053686,6.3699880264435089]
["   kommunen",{"$f":"IF('Blad 2 Indata'!B78>0,'Blad 2 Indata'!B78/'Blad 2 Indata'!B$71*100,0)","v":0},{"$f":"IF('Blad 2 Indata'!C78>0,'Blad 2 Indata'!C78/'Blad 2 Indata'!C$71*100,0)","v":0},{"$f":"IF('Blad 2 Indata'!D78>0,'Blad 2 Indata'!D78/'Blad 2 Indata'!D$71*100,0)","v":0},{"$f":"IF('Blad 2 Indata'!E78>0,'Blad 2 Indata'!E78/'Blad 2 Indata'!E$71*100,0)","v":0},{"$f":"IF('Blad 2 Indata'!F78>0,'Blad 2 Indata'!F78/'Blad 2 Indata'!F$71*100,0)","v":0},{"$f":"IF('Blad 2 Indata'!G78>0,'Blad 2 Indata'!G78/'Blad 2 Indata'!G$71*100,0)","v":0},{"$f":"IF('Blad 2 Indata'!H78>0,'Blad 2 Indata'!H78/'Blad 2 Indata'!H$71*100,0)","v":0},{"$f":"IF('Blad 2 Indata'!I78>0,'Blad 2 Indata'!I78/'Blad 2 Indata'!I$71*100,0)","v":0}]
[null,{"$f":"B48-B47","v":-4.8226509701226545},-5.1153273106113604,-5.4050202267241758,-5.6722428497728128,-5.911194920594375,-6.1125833523870927,-6.2618196275053686,-6.3699880264435089]
["Andel 90-"]
["   riket",{"$f":"B78/B$79*100","v":0.97315060018251065},0.98019232878162788,0.99373627068063475,1.0195156684163957,1.0477166246106255,1.0880508566695029,1.1328329313125016,1.1723450492585676]
["   kommunen",{"$f":"IF('Blad 2 Indata'!B79>0,'Blad 2 Indata'!B79/'Blad 2 Indata'!B$71*100,0)","v":0},{"$f":"IF('Blad 2 Indata'!C79>0,'Blad 2 Indata'!C79/'Blad 2 Indata'!C$71*100,0)","v":0},{"$f":"IF('Blad 2 Indata'!D79>0,'Blad 2 Indata'!D79/'Blad 2 Indata'!D$71*100,0)","v":0},{"$f":"IF('Blad 2 Indata'!E79>0,'Blad 2 Indata'!E79/'Blad 2 Indata'!E$71*100,0)","v":0},{"$f":"IF('Blad 2 Indata'!F79>0,'Blad 2 Indata'!F79/'Blad 2 Indata'!F$71*100,0)","v":0},{"$f":"IF('Blad 2 Indata'!G79>0,'Blad 2 Indata'!G79/'Blad 2 Indata'!G$71*100,0)","v":0},{"$f":"IF('Blad 2 Indata'!H79>0,'Blad 2 Indata'!H79/'Blad 2 Indata'!H$71*100,0)","v":0},{"$f":"IF('Blad 2 Indata'!I79>0,'Blad 2 Indata'!I79/'Blad 2 Indata'!I$71*100,0)","v":0}]
[null,{"$f":"B52-B51","v":-0.97315060018251065},-0.98019232878162788,-0.99373627068063475,-1.0195156684163957,-1.0477166246106255,-1.0880508566695029,-1.1328329313125016,-1.1723450492585676]
[]
["Prislappar i kostnadsutjämning"]
[]
["1-5 år",{"$f":"IF(ISERROR(VLOOKUP('Blad 2 Indata'!$B$1,Data!$A$2:$DH$292,69)),0,(VLOOKUP('Blad 2 Indata'!$B$1,Data!$A$2:$DH$292,69)))","v":0},{"$f":"IF(ISERROR(IF(VLOOKUP('Blad 2 Indata'!$B$1,Data!$A$2:$DH$292,78)=0,B57,(VLOOKUP('Blad 2 Indata'!$B$1,Data!$A$2:$DH$292,78)))),0,(IF(VLOOKUP('Blad 2 Indata'!$B$1,Data!$A$2:$DH$292,78)=0,B57,(VLOOKUP('Blad 2 Indata'!$B$1,Data!$A$2:$DH$292,78)))))","v":0},{"$f":"C57","v":0},{"$f":"D57","v":0},0,0,0,0]
["6-12 år",{"$f":"IF(ISERROR(VLOOKUP('Blad 2 Indata'!$B$1,Data!$A$2:$DH$292,70)),0,(VLOOKUP('Blad 2 Indata'!$B$1,Data!$A$2:$DH$292,70)))","v":0},{"$f":"IF(ISERROR(IF(VLOOKUP('Blad 2 Indata'!$B$1,Data!$A$2:$DH$292,79)=0,B58,(VLOOKUP('Blad 2 Indata'!$B$1,Data!$A$2:$DH$292,79)))),0,(IF(VLOOKUP('Blad 2 Indata'!$B$1,Data!$A$2:$DH$292,79)=0,B58,(VLOOKUP('Blad 2 Indata'!$B$1,Data!$A$2:$DH$292,79)))))","v":0},0,{"$f":"D58","v":0},{"$f":"E58","v":0},{"$f":"F58","v":0},{"$f":"G58","v":0},{"$f":"H58","v":0}]
["6 år",{"$f":"IF(ISERROR(VLOOKUP('Blad 2 Indata'!$B$1,Data!$A$2:$DH$292,71)),0,(VLOOKUP('Blad 2 Indata'!$B$1,Data!$A$2:$DH$292,71)))","v":0},{"$f":"IF(ISERROR(IF(VLOOKUP('Blad 2 Indata'!$B$1,Data!$A$2:$DH$292,80)=0,B59,(VLOOKUP('Blad 2 Indata'!$B$1,Data!$A$2:$DH$292,80)))),0,(IF(VLOOKUP('Blad 2 Indata'!$B$1,Data!$A$2:$DH$292,80)=0,B59,(VLOOKUP('Blad 2 Indata'!$B$1,Data!$A$2:$DH$292,80)))))","v":0},0,0,0,0,0,0]
["7-15 år",{"$f":"IF(ISERROR(VLOOKUP('Blad 2 Indata'!$B$1,Data!$A$2:$DH$292,72)),0,(VLOOKUP('Blad 2 Indata'!$B$1,Data!$A$2:$DH$292,72)))","v":0},{"$f":"IF(ISERROR(IF(VLOOKUP('Blad 2 Indata'!$B$1,Data!$A$2:$DH$292,81)=0,B60,(VLOOKUP('Blad 2 Indata'!$B$1,Data!$A$2:$DH$292,81)))),0,(IF(VLOOKUP('Blad 2 Indata'!$B$1,Data!$A$2:$DH$292,81)=0,B60,(VLOOKUP('Blad 2 Indata'!$B$1,Data!$A$2:$DH$292,81)))))","v":0},0,0,0,0,0,0]
["16-18 år",{"$f":"IF(ISERROR(VLOOKUP('Blad 2 Indata'!$B$1,Data!$A$2:$DH$292,73)),0,(VLOOKUP('Blad 2 Indata'!$B$1,Data!$A$2:$DH$292,73)))","v":0},{"$f":"IF(ISERROR(IF(VLOOKUP('Blad 2 Indata'!$B$1,Data!$A$2:$DH$292,82)=0,B61,(VLOOKUP('Blad 2 Indata'!$B$1,Data!$A$2:$DH$292,82)))),0,(IF(VLOOKUP('Blad 2 Indata'!$B$1,Data!$A$2:$DH$292,82)=0,B61,(VLOOKUP('Blad 2 Indata'!$B$1,Data!$A$2:$DH$292,82)))))","v":0},0,0,0,0,0,0]
["65-79 år",{"$f":"IF(ISERROR(VLOOKUP('Blad 2 Indata'!$B$1,Data!$A$2:$DH$292,74)),0,(VLOOKUP('Blad 2 Indata'!$B$1,Data!$A$2:$DH$292,74)))","v":0},{"$f":"IF(ISERROR(IF(VLOOKUP('Blad 2 Indata'!$B$1,Data!$A$2:$DH$292,83)=0,B62,(VLOOKUP('Blad 2 Indata'!$B$1,Data!$A$2:$DH$292,83)))),0,(IF(VLOOKUP('Blad 2 Indata'!$B$1,Data!$A$2:$DH$292,83)=0,B62,(VLOOKUP('Blad 2 Indata'!$B$1,Data!$A$2:$DH$292,83)))))","v":0},0,0,0,0,0,0]
["80-89 år",{"$f":"IF(ISERROR(VLOOKUP('Blad 2 Indata'!$B$1,Data!$A$2:$DH$292,75)),0,(VLOOKUP('Blad 2 Indata'!$B$1,Data!$A$2:$DH$292,75)))","v":0},{"$f":"IF(ISERROR(IF(VLOOKUP('Blad 2 Indata'!$B$1,Data!$A$2:$DH$292,84)=0,B63,(VLOOKUP('Blad 2 Indata'!$B$1,Data!$A$2:$DH$292,84)))),0,(IF(VLOOKUP('Blad 2 Indata'!$B$1,Data!$A$2:$DH$292,84)=0,B63,(VLOOKUP('Blad 2 Indata'!$B$1,Data!$A$2:$DH$292,84)))))","v":0},0,0,0,0,0,0]
["90-",{"$f":"IF(ISERROR(VLOOKUP('Blad 2 Indata'!$B$1,Data!$A$2:$DH$292,76)),0,(VLOOKUP('Blad 2 Indata'!$B$1,Data!$A$2:$DH$292,76)))","v":0},{"$f":"IF(ISERROR(IF(VLOOKUP('Blad 2 Indata'!$B$1,Data!$A$2:$DH$292,85)=0,B64,(VLOOKUP('Blad 2 Indata'!$B$1,Data!$A$2:$DH$292,85)))),0,(IF(VLOOKUP('Blad 2 Indata'!$B$1,Data!$A$2:$DH$292,85)=0,B64,(VLOOKUP('Blad 2 Indata'!$B$1,Data!$A$2:$DH$292,85)))))","v":0},0,0,0,0,0,0]
[]
[]
[]
[]
["Befolkningsuppgifter riket"]
[null,"31/12 2022","31/12 2023","31/12 2024","31/12 2025","31/12 2026","31/12 2027","31/12 2028","31/12 2029"]
["1-5 år",577473,559452,541747,524536,506039,496282,492397,492184]
["6-12 år",869491,864735,857556,850094,842992,828466,807686,788983]
["6 år",120949,120323,118121,116388,117291,108079,103575,101330]
["7-15 år",1129916,1125461,1120125,1109678,1102653,1095835,1080966,1060954]
["16-18 år",367238,373944,377916,384478,384453,384289,379769,380898]
["65-79 år",1563196,1556904,1548776,1541604,1539850,1544925,1562254,1583637]
["80-89 år",508872,541085,573057,602734,629453,652308,669710,682828]
["90-",102684,103682,105359,108334,111566,116112,121158,125669]
["Totalt",10551707,10577720,10602310,10626026,10648490,10671560,10695134,10719455]

{"sheet":"Blad 5 Inför.- o strukturbidrag","index":8,"n_rows":21,"n_cols":12,"rows_kept":21,"cut":false,"hidden":true,"merged":[]}
["Införande- och strukturbidrag",{"$f":"'Blad 2 Indata'!B1","v":0}]
["Kronor per invånare"]
[]
[null,null,null,null,{"$f":"'Blad 1 Totala intäkter'!B9","v":2024},{"$f":"E4+1","v":2025},{"$f":"F4+1","v":2026},2027,2028,2029,2030,2031]
[]
[]
[]
["Strukturbidrag 2013 kr/inv",null,{"$f":"ROUND(IF(ISERROR(VLOOKUP('Blad 2 Indata'!B$1,Data!A$2:DH$292,93)),0,(VLOOKUP('Blad 2 Indata'!B$1,Data!A$2:DH$292,93))),0)","v":0}]
["Därav 2004 års std för svagt bef",null,{"$f":"ROUND(IF(ISERROR(VLOOKUP('Blad 2 Indata'!B$1,Data!A$2:DH$292,94)),0,(VLOOKUP('Blad 2 Indata'!B$1,Data!A$2:DH$292,94))),0)","v":0}]
["Övriga delar av strukt",null,{"$f":"ROUND(IF(ISERROR(VLOOKUP('Blad 2 Indata'!B$1,Data!A$2:DH$292,95)),0,(VLOOKUP('Blad 2 Indata'!B$1,Data!A$2:DH$292,95))),0)","v":0}]
["Uppräknad skattekraft 14 ",null,{"$f":"ROUND(IF(ISERROR(VLOOKUP('Blad 2 Indata'!B$1,Data!A$2:DH$292,96)),0,(VLOOKUP('Blad 2 Indata'!B$1,Data!A$2:DH$292,96))),0)","v":0}]
["0,22 % av skattekraft 14",null,{"$f":"0.0022*C11","v":0}]
["Reducerat strukturbidr 0,22% av rest",null,{"$f":"IF(C10-C12<0,0,C10-C12)","v":0}]
["Strukturbidrag ",null,null,null,{"$f":"ROUND(IF(ISERROR(VLOOKUP('Blad 2 Indata'!B$1,Data!A$2:DH$292,100)),0,(VLOOKUP('Blad 2 Indata'!B$1,Data!A$2:DH$292,100))),0)","v":0},{"$f":"E14","v":0},{"$f":"F14","v":0},0,0,0,0,0]
[]
[]
[]
["Införandebidrag"]
[]
["Införandebidrag p.g.a. ändringar i kostnadsutjämningen",null,null,null,{"$f":"IF(ISERROR(VLOOKUP('Blad 2 Indata'!$B$1,Data!$A$2:$EG$292,102)),0,(VLOOKUP('Blad 2 Indata'!$B$1,Data!$A$2:$EG$292,102)))","v":0},{"$f":"IF(ISERROR(VLOOKUP('Blad 2 Indata'!$B$1,Data!$A$2:$EG$292,103)),0,(VLOOKUP('Blad 2 Indata'!$B$1,Data!$A$2:$EG$292,103)))","v":0},{"$f":"IF(ISERROR(VLOOKUP('Blad 2 Indata'!$B$1,Data!$A$2:$EG$292,104)),0,(VLOOKUP('Blad 2 Indata'!$B$1,Data!$A$2:$EG$292,104)))","v":0},{"$f":"IF(ISERROR(VLOOKUP('Blad 2 Indata'!$B$1,Data!$A$2:$EG$292,105)),0,(VLOOKUP('Blad 2 Indata'!$B$1,Data!$A$2:$EG$292,105)))","v":0},{"$f":"IF(ISERROR(VLOOKUP('Blad 2 Indata'!$B$1,Data!$A$2:$EG$292,106)),0,(VLOOKUP('Blad 2 Indata'!$B$1,Data!$A$2:$EG$292,106)))","v":0},{"$f":"IF(ISERROR(VLOOKUP('Blad 2 Indata'!$B$1,Data!$A$2:$EG$292,107)),0,(VLOOKUP('Blad 2 Indata'!$B$1,Data!$A$2:$EG$292,107)))","v":0},{"$f":"IF(ISERROR(VLOOKUP('Blad 2 Indata'!$B$1,Data!$A$2:$EG$292,108)),0,(VLOOKUP('Blad 2 Indata'!$B$1,Data!$A$2:$EG$292,108)))","v":0},0]
["Summa införandebidrag",null,null,null,{"$f":"E19+E20","v":0},0,0,0,0,0,0,0]

{"sheet":"Blad 6 Befolkningsförändringar","index":9,"n_rows":110,"n_cols":10,"rows_kept":110,"cut":false,"hidden":true,"merged":[]}
["Befolkningsförändringar"]
["Kronor per invånare"]
[null,{"$f":"'Blad 1 Totala intäkter'!B9-1","v":2023},{"$f":"B3+1","v":2024},2025,2026,2027,2028,2029,2030,2031]
[]
["Ersättning för förändring av totalfolkmängd"]
["Totalt",null,{"$f":"'Blad 2 Indata'!B71","v":0},{"$f":"IF('Blad 2 Indata'!C71<>0,'Blad 2 Indata'!C71,0)","v":0},{"$f":"IF('Blad 2 Indata'!D71<>0,'Blad 2 Indata'!D71,0)","v":0},{"$f":"IF('Blad 2 Indata'!E71<>0,'Blad 2 Indata'!E71,0)","v":0},{"$f":"IF('Blad 2 Indata'!F71<>0,'Blad 2 Indata'!F71,0)","v":0},{"$f":"IF('Blad 2 Indata'!G71<>0,'Blad 2 Indata'!G71,0)","v":0},{"$f":"IF('Blad 2 Indata'!H71<>0,'Blad 2 Indata'!H71,0)","v":0},{"$f":"IF('Blad 2 Indata'!I71<>0,'Blad 2 Indata'!I71,0)","v":0}]
["Totalt, 10 år innan",null,{"$f":"'Blad 2 Indata'!B81","v":0},{"$f":"IF(D6<>0,'Blad 2 Indata'!C81,0)","v":0},{"$f":"IF(E6<>0,'Blad 2 Indata'!D81,0)","v":0},{"$f":"IF(F6<>0,'Blad 2 Indata'!E81,0)","v":0},{"$f":"IF(G6<>0,'Blad 2 Indata'!F81,0)","v":0},{"$f":"IF(H6<>0,'Blad 2 Indata'!G81,0)","v":0},{"$f":"IF(I6<>0,'Blad 2 Indata'!H81,0)","v":0},{"$f":"IF(J6<>0,'Blad 2 Indata'!I81,0)","v":0}]
["Förändring, procent",null,{"$f":"IF(C6<>0,(C6/C7-1)*100,0)","v":0},{"$f":"IF(D6<>0,(D6/D7-1)*100,0)","v":0},0,0,0,0,0,0]
["Ersättning per procentenhet",null,200,200,200,200,200,200,200,200]
["Gräns för ersättning",2]
["Ersättning",null,{"$f":"IF(((C8+$B$10)<0),((ABS(C8))-$B$10)*$C$9,0)","v":0},{"$f":"IF(((D8+$B$10)<0),((ABS(D8))-$B$10)*$D$9,0)","v":0},{"$f":"IF(((E8+$B$10)<0),((ABS(E8))-$B$10)*$E$9,0)","v":0},{"$f":"IF(((F8+$B$10)<0),((ABS(F8))-$B$10)*$F$9,0)","v":0},{"$f":"IF(((G8+$B$10)<0),((ABS(G8))-$B$10)*$G$9,0)","v":0},{"$f":"IF(((H8+$B$10)<0),((ABS(H8))-$B$10)*$H$9,0)","v":0},{"$f":"IF(((I8+$B$10)<0),((ABS(I8))-$B$10)*$I$9,0)","v":0},{"$f":"IF(((J8+$B$10)<0),((ABS(J8))-$B$10)*$J$9,0)","v":0}]
[]
["Ersättning för förändring av antalet barn och elever"]
["Befolkning riket"]
["1-5 år 31.12, 5 år innan",null,{"$f":"Data!BE294","v":607451},{"$f":"Data!BF294","v":610134},{"$f":"Data!BG294","v":610904},{"$f":"Data!BH294","v":604630},{"$f":"Data!BI294","v":599212},{"$f":"'Blad 4 Kostnadsutjämning'!B71","v":577473},{"$f":"'Blad 4 Kostnadsutjämning'!C71","v":559452},{"$f":"'Blad 4 Kostnadsutjämning'!D71","v":541747}]
["1-5 år 31.12 året innan",null,{"$f":"'Blad 4 Kostnadsutjämning'!B71","v":577473},{"$f":"'Blad 4 Kostnadsutjämning'!C71","v":559452},{"$f":"'Blad 4 Kostnadsutjämning'!D71","v":541747},{"$f":"'Blad 4 Kostnadsutjämning'!E71","v":524536},{"$f":"'Blad 4 Kostnadsutjämning'!F71","v":506039},{"$f":"'Blad 4 Kostnadsutjämning'!G71","v":496282},{"$f":"'Blad 4 Kostnadsutjämning'!H71","v":492397},{"$f":"'Blad 4 Kostnadsutjämning'!I71","v":492184}]
["Förändring, procent",null,{"$f":"(C16/C15-1)*100","v":-4.9350482590365345},-8.3066998397073437,-11.320436598876416,-13.246779021881149,-15.549254687823344,-14.059704955902696,{"$f":"(I16/I15-1)*100","v":-11.985836139650941},{"$f":"(J16/J15-1)*100","v":-9.1487354798457599}]
[]
["6-15 år 31.12, 5 år innan",null,{"$f":"Data!AY294","v":1181186},{"$f":"Data!AZ294","v":1207133},{"$f":"Data!BA294","v":1225478},{"$f":"Data!BB294","v":1237497},{"$f":"Data!BC294","v":1247539},{"$f":"Data!BD294","v":1254735},{"$f":"+D20","v":1245784},{"$f":"+E20","v":1238246}]
["6-15 år 31.12 året innan",null,{"$f":"'Blad 4 Kostnadsutjämning'!B73+'Blad 4 Kostnadsutjämning'!B74","v":1250865},{"$f":"'Blad 4 Kostnadsutjämning'!C73+'Blad 4 Kostnadsutjämning'!C74","v":1245784},{"$f":"'Blad 4 Kostnadsutjämning'!D73+'Blad 4 Kostnadsutjämning'!D74","v":1238246},{"$f":"'Blad 4 Kostnadsutjämning'!E73+'Blad 4 Kostnadsutjämning'!E74","v":1226066},{"$f":"'Blad 4 Kostnadsutjämning'!F73+'Blad 4 Kostnadsutjämning'!F74","v":1219944},{"$f":"'Blad 4 Kostnadsutjämning'!G73+'Blad 4 Kostnadsutjämning'!G74","v":1203914},{"$f":"'Blad 4 Kostnadsutjämning'!H73+'Blad 4 Kostnadsutjämning'!H74","v":1184541},{"$f":"'Blad 4 Kostnadsutjämning'!I73+'Blad 4 Kostnadsutjämning'!I74","v":1162284}]
["Förändring, procent",null,{"$f":"(C20/C19-1)*100","v":5.8990709337902736},3.2018841337284387,1.0418791687814899,-0.92371941103696065,-2.2119548968008163,-4.0503373222234185,-4.9160207548017976,-6.1346452966534954]
[]
["16-18 år 31.12, 5 år innan",null,{"$f":"Data!CO294","v":325507},{"$f":"Data!CP294","v":332330},{"$f":"Data!CQ294","v":339069},{"$f":"Data!CR294","v":347667},{"$f":"Data!CS294","v":353807},{"$f":"Data!CT294","v":361331},{"$f":"+D24","v":373944},{"$f":"+E24","v":377916}]
["16-18 år 31.12 året innan",null,{"$f":"'Blad 4 Kostnadsutjämning'!B75","v":367238},{"$f":"'Blad 4 Kostnadsutjämning'!C75","v":373944},{"$f":"'Blad 4 Kostnadsutjämning'!D75","v":377916},{"$f":"'Blad 4 Kostnadsutjämning'!E75","v":384478},{"$f":"'Blad 4 Kostnadsutjämning'!F75","v":384453},{"$f":"'Blad 4 Kostnadsutjämning'!G75","v":384289},{"$f":"'Blad 4 Kostnadsutjämning'!H75","v":379769},{"$f":"'Blad 4 Kostnadsutjämning'!I75","v":380898}]
["Förändring, procent",null,{"$f":"(C24/C23-1)*100","v":12.820308011809267},{"$f":"(D24/D23-1)*100","v":12.521890891583665},11.456960087769751,10.588005188873261,8.661784532244976,6.3537310665290336,1.5577198724942676,0.78906423649700574]
[]
["Befolkning i kommunen"]
["1-5 år 31.12 5 år innan",null,{"$f":"'Blad 2 Indata'!B83","v":0},{"$f":"'Blad 2 Indata'!C83","v":0},{"$f":"'Blad 2 Indata'!D83","v":0},{"$f":"'Blad 2 Indata'!E83","v":0},{"$f":"'Blad 2 Indata'!F83","v":0},{"$f":"'Blad 2 Indata'!G83","v":0},{"$f":"'Blad 2 Indata'!H83","v":0},{"$f":"'Blad 2 Indata'!I83","v":0}]
["1-5 år 31.12 året innan",null,{"$f":"'Blad 2 Indata'!B72","v":0},{"$f":"'Blad 2 Indata'!C72","v":0},{"$f":"'Blad 2 Indata'!D72","v":0},{"$f":"'Blad 2 Indata'!E72","v":0},{"$f":"'Blad 2 Indata'!F72","v":0},{"$f":"'Blad 2 Indata'!G72","v":0},{"$f":"'Blad 2 Indata'!H72","v":0},{"$f":"'Blad 2 Indata'!I72","v":0}]
["Förändring, procent",null,{"$f":"IF(C29<>0,(C29/C28-1)*100,0)","v":0},{"$f":"IF(D29<>0,(D29/D28-1)*100,0)","v":0},0,0,0,0,0,0]
[]
["6-15 år, 5 år innan",null,{"$f":"'Blad 2 Indata'!B84","v":0},{"$f":"'Blad 2 Indata'!C84","v":0},{"$f":"'Blad 2 Indata'!D84","v":0},{"$f":"'Blad 2 Indata'!E84","v":0},{"$f":"'Blad 2 Indata'!F84","v":0},{"$f":"'Blad 2 Indata'!G84","v":0},{"$f":"'Blad 2 Indata'!H84","v":0},{"$f":"'Blad 2 Indata'!I84","v":0}]
["6-15 år, året innan",null,{"$f":"'Blad 2 Indata'!B74+'Blad 2 Indata'!B75","v":0},{"$f":"'Blad 2 Indata'!C74+'Blad 2 Indata'!C75","v":0},{"$f":"'Blad 2 Indata'!D74+'Blad 2 Indata'!D75","v":0},{"$f":"'Blad 2 Indata'!E74+'Blad 2 Indata'!E75","v":0},{"$f":"'Blad 2 Indata'!F74+'Blad 2 Indata'!F75","v":0},{"$f":"'Blad 2 Indata'!G74+'Blad 2 Indata'!G75","v":0},{"$f":"'Blad 2 Indata'!H74+'Blad 2 Indata'!H75","v":0},{"$f":"'Blad 2 Indata'!I74+'Blad 2 Indata'!I75","v":0}]
["Förändring, procent",null,{"$f":"IF(C33<>0,(C33/C32-1)*100,0)","v":0},{"$f":"IF(D33<>0,(D33/D32-1)*100,0)","v":0},0,0,0,0,0,0]
[]
["16-18 år, 5 år innan",null,{"$f":"'Blad 2 Indata'!B85","v":0},{"$f":"'Blad 2 Indata'!C85","v":0},{"$f":"'Blad 2 Indata'!D85","v":0},{"$f":"'Blad 2 Indata'!E85","v":0},{"$f":"'Blad 2 Indata'!F85","v":0},{"$f":"'Blad 2 Indata'!G85","v":0},{"$f":"'Blad 2 Indata'!H85","v":0},{"$f":"'Blad 2 Indata'!I85","v":0}]
["16-18 år, året innan",null,{"$f":"'Blad 2 Indata'!B76","v":0},{"$f":"'Blad 2 Indata'!C76","v":0},{"$f":"'Blad 2 Indata'!D76","v":0},{"$f":"'Blad 2 Indata'!E76","v":0},{"$f":"'Blad 2 Indata'!F76","v":0},{"$f":"'Blad 2 Indata'!G76","v":0},{"$f":"'Blad 2 Indata'!H76","v":0},{"$f":"'Blad 2 Indata'!I76","v":0}]
["Förändring, procent",null,{"$f":"IF(C37<>0,(C37/C36-1)*100,0)","v":0},{"$f":"IF(D37<>0,(D37/D36-1)*100,0)","v":0},0,0,0,0,0,0]
[]
["Ersättning för ökat antal förskolebarn och elever "]
["Ersättning per barn 1-5 år",null,14169.5558544384,{"$f":"'Blad 2 Indata'!D110","v":15260.611655230156}]
["Ersättning per elev 6-15 år",null,17003.467025326081,{"$f":"'Blad 2 Indata'!D111","v":18312.733986276187}]
["Ersättning per elev 16-18 år",null,17003.467025326081,{"$f":"'Blad 2 Indata'!D112","v":18312.733986276187}]
["Icke ersatt ökning utöver riket, procent",2]
[]
["Gräns för ersättning förskolebarn 1-5 år",null,{"$f":"IF((C17+$B$44)<$B$44,$B$44,C17+$B$44)","v":2},{"$f":"IF((D17+$B$44)<$B$44,$B$44,D17+$B$44)","v":2},2,2,2,2,2,2]
["Ersatta ökning, procent",null,{"$f":"IF(C30>C46,C30-C46,0)","v":0},{"$f":"IF(D30>D46,D30-D46,0)","v":0},0,0,0,0,0,0]
["Ersättning",null,{"$f":"IF(C29<>0,IF(C47>0,(C29)-C28*(1+((C46)/100)),0)*$C$41/'Blad 2 Indata'!B71,0)","v":0},{"$f":"IF(D29<>0,IF(D47>0,(D29)-D28*(1+((D46)/100)),0)*$D$41/'Blad 2 Indata'!C71,0)","v":0},{"$f":"IF(E29<>0,IF(E47>0,(E29)-E28*(1+((E46)/100)),0)*$D$41/'Blad 2 Indata'!D71,0)","v":0},{"$f":"IF(F29<>0,IF(F47>0,(F29)-F28*(1+((F46)/100)),0)*$D$41/'Blad 2 Indata'!E71,0)","v":0},{"$f":"IF(G29<>0,IF(G47>0,(G29)-G28*(1+((G46)/100)),0)*$D$41/'Blad 2 Indata'!F71,0)","v":0},{"$f":"IF(H29<>0,IF(H47>0,(H29)-H28*(1+((H46)/100)),0)*$D$41/'Blad 2 Indata'!G71,0)","v":0},{"$f":"IF(I29<>0,IF(I47>0,(I29)-I28*(1+((I46)/100)),0)*$D$41/'Blad 2 Indata'!H71,0)","v":0},{"$f":"IF(J29<>0,IF(J47>0,(J29)-J28*(1+((J46)/100)),0)*$D$41/'Blad 2 Indata'!I71,0)","v":0}]
[]
["Gräns för ersättning grundskoleelever 6-15 år",null,{"$f":"IF((C21+$B$44)<$B$44,$B$44,C21+$B$44)","v":7.8990709337902736},5.2018841337284387,3.0418791687814899,2,2,2,2,2]
["Ersatta ökning, procent",null,{"$f":"IF(C34>C50,C34-C50,0)","v":0},{"$f":"IF(D34>D50,D34-D50,0)","v":0},0,0,0,0,0,0]
["Ersättning",null,{"$f":"IF(C33<>0,IF(C51>0,(C33)-C32*(1+((C50)/100)),0)*$C$42/'Blad 2 Indata'!B71,0)","v":0},{"$f":"IF(D33<>0,IF(D51>0,(D33)-D32*(1+((D50)/100)),0)*$D$42/'Blad 2 Indata'!C71,0)","v":0},{"$f":"IF(E33<>0,IF(E51>0,(E33)-E32*(1+((E50)/100)),0)*$D$42/'Blad 2 Indata'!D71,0)","v":0},{"$f":"IF(F33<>0,IF(F51>0,(F33)-F32*(1+((F50)/100)),0)*$D$42/'Blad 2 Indata'!E71,0)","v":0},{"$f":"IF(G33<>0,IF(G51>0,(G33)-G32*(1+((G50)/100)),0)*$D$42/'Blad 2 Indata'!F71,0)","v":0},{"$f":"IF(H33<>0,IF(H51>0,(H33)-H32*(1+((H50)/100)),0)*$D$42/'Blad 2 Indata'!G71,0)","v":0},{"$f":"IF(I33<>0,IF(I51>0,(I33)-I32*(1+((I50)/100)),0)*$D$42/'Blad 2 Indata'!H71,0)","v":0},{"$f":"IF(J33<>0,IF(J51>0,(J33)-J32*(1+((J50)/100)),0)*$D$42/'Blad 2 Indata'!I71,0)","v":0}]
[]
["Gräns för ersättning gymnasieelever 16-18 år",null,{"$f":"IF((C25+$B$44)<$B$44,$B$44,C25+$B$44)","v":14.820308011809267},{"$f":"IF((D25+$B$44)<$B$44,$B$44,D25+$B$44)","v":14.521890891583665},13.456960087769751,12.588005188873261,10.661784532244976,8.3537310665290327,3.5577198724942676,2.7890642364970057]
["Ersatta ökning, procent",null,{"$f":"IF(C38>C54,C38-C54,0)","v":0},{"$f":"IF(D38>D54,D38-D54,0)","v":0},0,0,0,0,0,0]
["Ersättning",null,{"$f":"IF(C37<>0,IF(C55>0,(C37)-C36*(1+((C54)/100)),0)*$C$43/'Blad 2 Indata'!B71,0)","v":0},{"$f":"IF(D37<>0,IF(D55>0,(D37)-D36*(1+((D54)/100)),0)*$D$43/'Blad 2 Indata'!C71,0)","v":0},{"$f":"IF(E37<>0,IF(E55>0,(E37)-E36*(1+((E54)/100)),0)*$D$43/'Blad 2 Indata'!D71,0)","v":0},{"$f":"IF(F37<>0,IF(F55>0,(F37)-F36*(1+((F54)/100)),0)*$D$43/'Blad 2 Indata'!E71,0)","v":0},{"$f":"IF(G37<>0,IF(G55>0,(G37)-G36*(1+((G54)/100)),0)*$D$43/'Blad 2 Indata'!F71,0)","v":0},{"$f":"IF(H37<>0,IF(H55>0,(H37)-H36*(1+((H54)/100)),0)*$D$43/'Blad 2 Indata'!G71,0)","v":0},{"$f":"IF(I37<>0,IF(I55>0,(I37)-I36*(1+((I54)/100)),0)*$D$43/'Blad 2 Indata'!H71,0)","v":0},{"$f":"IF(J37<>0,IF(J55>0,(J37)-J36*(1+((J54)/100)),0)*$D$43/'Blad 2 Indata'!I71,0)","v":0}]
[]
[]
["Ersättning för minskat antal barn och elever"]
["Ersättning per barn 1-5 år",null,14169.5558544384,{"$f":"D41","v":15260.611655230156}]
["Ersättning per elev 6-15 år",null,17003.467025326081,{"$f":"D42","v":18312.733986276187}]
["Ersättning per elev 16-18 år",null,17003.467025326081,{"$f":"D43","v":18312.733986276187}]
["Icke ersatt minskning utöver riket, procent",-2]
[]
["Gräns för ersättning förskolebarn 1-5 år",null,{"$f":"IF((C17>0),$B$63,C17+$B$63)","v":-6.9350482590365345},{"$f":"IF((D17>0),$B$63,D17+$B$63)","v":-10.306699839707344},-13.320436598876416,-15.246779021881149,-17.549254687823343,-16.059704955902696,-13.985836139650941,-11.14873547984576]
["Ersatta minskning, procent",null,{"$f":"IF(C30<C65,C30-C65,0)","v":0},{"$f":"IF(D30<D65,D30-D65,0)","v":0},0,0,0,0,0,0]
["Ersättning",null,{"$f":"IF(ISERROR(IF(C29<>0,IF(C66<0,C28*(1+(C65/100))-C28))*$C$60/'Blad 2 Indata'!B71),0,(IF(C29<>0,IF(C66<0,C28*(1+(C65/100))-C29))*$C$60/'Blad 2 Indata'!B71))","v":0},{"$f":"IF(ISERROR(IF(D29<>0,IF(D66<0,D28*(1+(D65/100))-D28))*$D$60/'Blad 2 Indata'!C71),0,(IF(D29<>0,IF(D66<0,D28*(1+(D65/100))-D29))*$D$60/'Blad 2 Indata'!C71))","v":0},{"$f":"IF(ISERROR(IF(E29<>0,IF(E66<0,E28*(1+(E65/100))-E28))*$D$60/'Blad 2 Indata'!D71),0,(IF(E29<>0,IF(E66<0,E28*(1+(E65/100))-E29))*$D$60/'Blad 2 Indata'!D71))","v":0},{"$f":"IF(ISERROR(IF(F29<>0,IF(F66<0,F28*(1+(F65/100))-F28))*$D$60/'Blad 2 Indata'!E71),0,(IF(F29<>0,IF(F66<0,F28*(1+(F65/100))-F29))*$D$60/'Blad 2 Indata'!E71))","v":0},{"$f":"IF(ISERROR(IF(G29<>0,IF(G66<0,G28*(1+(G65/100))-G28))*$D$60/'Blad 2 Indata'!F71),0,(IF(G29<>0,IF(G66<0,G28*(1+(G65/100))-G29))*$D$60/'Blad 2 Indata'!F71))","v":0},{"$f":"IF(ISERROR(IF(H29<>0,IF(H66<0,H28*(1+(H65/100))-H28))*$D$60/'Blad 2 Indata'!G71),0,(IF(H29<>0,IF(H66<0,H28*(1+(H65/100))-H29))*$D$60/'Blad 2 Indata'!G71))","v":0},{"$f":"IF(ISERROR(IF(I29<>0,IF(I66<0,I28*(1+(I65/100))-I28))*$D$60/'Blad 2 Indata'!H71),0,(IF(I29<>0,IF(I66<0,I28*(1+(I65/100))-I29))*$D$60/'Blad 2 Indata'!H71))","v":0},{"$f":"IF(ISERROR(IF(J29<>0,IF(J66<0,J28*(1+(J65/100))-J28))*$D$60/'Blad 2 Indata'!I71),0,(IF(J29<>0,IF(J66<0,J28*(1+(J65/100))-J29))*$D$60/'Blad 2 Indata'!I71))","v":0}]
[]
["Gräns för ersättning grundskoleelever 6-15 år",null,{"$f":"IF((C21>0),$B$63,C21+$B$63)","v":-2},{"$f":"IF((D21>0),$B$63,D21+$B$63)","v":-2},-2,-2.9237194110369606,-4.2119548968008163,-6.0503373222234185,-6.9160207548017976,-8.1346452966534954]
["Ersatta minskning, procent",null,{"$f":"IF(C34<C69,C34-C69,0)","v":0},{"$f":"IF(D34<D69,D34-D69,0)","v":0},0,0,0,0,0,0]
["Ersättning",null,{"$f":"IF(ISERROR(IF(C33<>0,IF(C70<0,C32*(1+(C69/100))-C32))*$C$61/'Blad 2 Indata'!B71),0,(IF(C33<>0,IF(C70<0,C32*(1+(C69/100))-C33))*$C$61/'Blad 2 Indata'!B71))","v":0},{"$f":"IF(ISERROR(IF(D33<>0,IF(D70<0,D32*(1+(D69/100))-D32))*$D$61/'Blad 2 Indata'!C71),0,(IF(D33<>0,IF(D70<0,D32*(1+(D69/100))-D33))*$D$61/'Blad 2 Indata'!C71))","v":0},{"$f":"IF(ISERROR(IF(E33<>0,IF(E70<0,E32*(1+(E69/100))-E32))*$D$61/'Blad 2 Indata'!D71),0,(IF(E33<>0,IF(E70<0,E32*(1+(E69/100))-E33))*$D$61/'Blad 2 Indata'!D71))","v":0},{"$f":"IF(ISERROR(IF(F33<>0,IF(F70<0,F32*(1+(F69/100))-F32))*$D$61/'Blad 2 Indata'!E71),0,(IF(F33<>0,IF(F70<0,F32*(1+(F69/100))-F33))*$D$61/'Blad 2 Indata'!E71))","v":0},{"$f":"IF(ISERROR(IF(G33<>0,IF(G70<0,G32*(1+(G69/100))-G32))*$D$61/'Blad 2 Indata'!F71),0,(IF(G33<>0,IF(G70<0,G32*(1+(G69/100))-G33))*$D$61/'Blad 2 Indata'!F71))","v":0},{"$f":"IF(ISERROR(IF(H33<>0,IF(H70<0,H32*(1+(H69/100))-H32))*$D$61/'Blad 2 Indata'!G71),0,(IF(H33<>0,IF(H70<0,H32*(1+(H69/100))-H33))*$D$61/'Blad 2 Indata'!G71))","v":0},{"$f":"IF(ISERROR(IF(I33<>0,IF(I70<0,I32*(1+(I69/100))-I32))*$D$61/'Blad 2 Indata'!H71),0,(IF(I33<>0,IF(I70<0,I32*(1+(I69/100))-I33))*$D$61/'Blad 2 Indata'!H71))","v":0},{"$f":"IF(ISERROR(IF(J33<>0,IF(J70<0,J32*(1+(J69/100))-J32))*$D$61/'Blad 2 Indata'!I71),0,(IF(J33<>0,IF(J70<0,J32*(1+(J69/100))-J33))*$D$61/'Blad 2 Indata'!I71))","v":0}]
[]
["Gräns för ersättning gymnasieelever 16-18 år",null,{"$f":"IF((C25>0),$B$63,C25+$B$63)","v":-2},{"$f":"IF((D25>0),$B$63,D25+$B$63)","v":-2},-2,-2,-2,-2,-2,-2]
["Ersatta minskning, procent",null,{"$f":"IF(C38<C73,C38-C73,0)","v":0},{"$f":"IF(D38<D73,D38-D73,0)","v":0},{"$f":"IF(E38<E73,E38-E73,0)","v":0},0,0,0,0,0]
["Ersättning",null,{"$f":"IF(ISERROR(IF(C37<>0,IF(C74<0,C36*(1+(C73/100))-C36))*$C$62/'Blad 2 Indata'!B71),0,(IF(C37<>0,IF(C74<0,C36*(1+(C73/100))-C37))*$C$62/'Blad 2 Indata'!B71))","v":0},{"$f":"IF(ISERROR(IF(D37<>0,IF(D74<0,D36*(1+(D73/100))-D36))*$D$62/'Blad 2 Indata'!C71),0,(IF(D37<>0,IF(D74<0,D36*(1+(D73/100))-D37))*$D$62/'Blad 2 Indata'!C71))","v":0},{"$f":"IF(ISERROR(IF(E37<>0,IF(E74<0,E36*(1+(E73/100))-E36))*$D$62/'Blad 2 Indata'!D71),0,(IF(E37<>0,IF(E74<0,E36*(1+(E73/100))-E37))*$D$62/'Blad 2 Indata'!D71))","v":0},{"$f":"IF(ISERROR(IF(F37<>0,IF(F74<0,F36*(1+(F73/100))-F36))*$D$62/'Blad 2 Indata'!E71),0,(IF(F37<>0,IF(F74<0,F36*(1+(F73/100))-F37))*$D$62/'Blad 2 Indata'!E71))","v":0},{"$f":"IF(ISERROR(IF(G37<>0,IF(G74<0,G36*(1+(G73/100))-G36))*$D$62/'Blad 2 Indata'!F71),0,(IF(G37<>0,IF(G74<0,G36*(1+(G73/100))-G37))*$D$62/'Blad 2 Indata'!F71))","v":0},{"$f":"IF(ISERROR(IF(H37<>0,IF(H74<0,H36*(1+(H73/100))-H36))*$D$62/'Blad 2 Indata'!G71),0,(IF(H37<>0,IF(H74<0,H36*(1+(H73/100))-H37))*$D$62/'Blad 2 Indata'!G71))","v":0},{"$f":"IF(ISERROR(IF(I37<>0,IF(I74<0,I36*(1+(I73/100))-I36))*$D$62/'Blad 2 Indata'!H71),0,(IF(I37<>0,IF(I74<0,I36*(1+(I73/100))-I37))*$D$62/'Blad 2 Indata'!H71))","v":0},{"$f":"IF(ISERROR(IF(J37<>0,IF(J74<0,J36*(1+(J73/100))-J36))*$D$62/'Blad 2 Indata'!I71),0,(IF(J37<>0,IF(J74<0,J36*(1+(J73/100))-J37))*$D$62/'Blad 2 Indata'!I71))","v":0}]
[]
["Summa ersättning total befolkning samt barn och elever, kr per invånare",null,{"$f":"ROUND((C11+C48+C52+C56+C67+C71+C75),0)","v":0},{"$f":"ROUND((D11+D48+D52+D56+D67+D71+D75),0)","v":0},0,0,0,0,0,0]
[]
["Ersättning för eftersläpning"]
[]
["Folkmängd 1 nov"]
["året innan",{"$f":"'Blad 2 Indata'!B29","v":0},{"$f":"'Blad 2 Indata'!C29","v":0},{"$f":"IF('Blad 2 Indata'!$O$3=1,'Blad 2 Indata'!D29,'Blad 2 Indata'!D30)","v":0},{"$f":"IF('Blad 2 Indata'!$O$3=1,'Blad 2 Indata'!E29,'Blad 2 Indata'!E30)","v":0},{"$f":"IF('Blad 2 Indata'!$O$3=1,'Blad 2 Indata'!F29,'Blad 2 Indata'!F30)","v":0},{"$f":"IF('Blad 2 Indata'!$O$3=1,'Blad 2 Indata'!G29,'Blad 2 Indata'!G30)","v":0},{"$f":"IF('Blad 2 Indata'!$O$3=1,'Blad 2 Indata'!H29,'Blad 2 Indata'!H30)","v":0},{"$f":"IF('Blad 2 Indata'!$O$3=1,'Blad 2 Indata'!I29,'Blad 2 Indata'!I30)","v":0},{"$f":"IF('Blad 2 Indata'!$O$3=1,'Blad 2 Indata'!J29,'Blad 2 Indata'!J30)","v":0}]
["2 år innan",{"$f":"'Blad 2 Indata'!E88","v":0},{"$f":"B82","v":0},0,0,0,0,0,0,0]
["3 år innan",{"$f":"'Blad 2 Indata'!D88","v":0},{"$f":"B83","v":0},{"$f":"C83","v":0},0,0,0,0,0,0]
["4 år innan",{"$f":"'Blad 2 Indata'!C88","v":0},0,0,{"$f":"D84","v":0},0,0,{"$f":"G84","v":0},0,0]
["5 år innan",{"$f":"'Blad 2 Indata'!B88","v":0},0,0,0,0,0,0,0,0]
[]
["Procentuell förändring"]
[null,null,{"$f":"IF(ISERROR(B82/B83-1),0,(B82/B83-1))","v":0},{"$f":"IF(ISERROR(C82/C83-1),0,(C82/C83-1))","v":0},{"$f":"IF(ISERROR(D82/D83-1),0,(D82/D83-1))","v":0},{"$f":"IF(ISERROR(E82/E83-1),0,(E82/E83-1))","v":0},0,{"$f":"IF(ISERROR(G82/G83-1),0,(G82/G83-1))","v":0},0,0]
[null,null,0,{"$f":"IF(ISERROR(C83/C84-1),0,(C83/C84-1))","v":0},{"$f":"IF(ISERROR(D83/D84-1),0,(D83/D84-1))","v":0},{"$f":"IF(ISERROR(E83/E84-1),0,(E83/E84-1))","v":0},0,0,0,0]
[null,null,0,0,0,0,{"$f":"IF(ISERROR(F84/F85-1),0,(F84/F85-1))","v":0},0,0,0]
[null,null,0,{"$f":"IF(ISERROR(C85/C86-1),0,(C85/C86-1))","v":0},0,0,{"$f":"IF(ISERROR(F85/F86-1),0,(F85/F86-1))","v":0},{"$f":"IF(ISERROR(G85/G86-1),0,(G85/G86-1))","v":0},0,0]
[]
["Genomsnitt på 5 år",null,{"$f":"PRODUCT(1+C89:C92)^(1/4)-1","v":0},{"$f":"PRODUCT(1+D89:D92)^(1/4)-1","v":0},{"$f":"PRODUCT(1+E89:E92)^(1/4)-1","v":0},{"$f":"PRODUCT(1+F89:F92)^(1/4)-1","v":0},{"$f":"PRODUCT(1+G89:G92)^(1/4)-1","v":0},{"$f":"PRODUCT(1+H89:H92)^(1/4)-1","v":0},{"$f":"PRODUCT(1+I89:I92)^(1/4)-1","v":0},{"$f":"PRODUCT(1+J89:J92)^(1/4)-1","v":0}]
[]
["Gräns på 5 år",1.2E-2]
[]
["Procentuell förändring nov - nov",null,{"$f":"IF(ISERROR(C82/C83-1),0,(C82/C83-1))","v":0},{"$f":"IF(ISERROR(D82/D83-1),0,(D82/D83-1))","v":0},{"$f":"IF(ISERROR(E82/E83-1),0,(E82/E83-1))","v":0},0,0,0,0,0]
[]
["Gräns, nov - nov",1.2E-2]
[]
["Antal ersatta personer",null,null,{"$f":"IF(D94>$B$96,IF(D98>$B$100,(D82-D83)-D83*($B$100),0),0)","v":0},0,0,0,0,0,0]
[]
["Utbetalat året innan, tkr",null,null,{"$f":"('Blad 1 Totala intäkter'!K14+'Blad 1 Totala intäkter'!K16+'Blad 1 Totala intäkter'!K18+'Blad 1 Totala intäkter'!K20+'Blad 1 Totala intäkter'!K22)*C82/1000","v":0},{"$f":"('Blad 1 Totala intäkter'!L14+'Blad 1 Totala intäkter'!L16+'Blad 1 Totala intäkter'!L18+'Blad 1 Totala intäkter'!L20+'Blad 1 Totala intäkter'!L22)*D82/1000","v":0},{"$f":"('Blad 1 Totala intäkter'!M14+'Blad 1 Totala intäkter'!M16+'Blad 1 Totala intäkter'!M18+'Blad 1 Totala intäkter'!M20+'Blad 1 Totala intäkter'!M22)*E82/1000","v":0},{"$f":"('Blad 1 Totala intäkter'!N14+'Blad 1 Totala intäkter'!N16+'Blad 1 Totala intäkter'!N18+'Blad 1 Totala intäkter'!N20+'Blad 1 Totala intäkter'!N22)*F82/1000","v":0},{"$f":"('Blad 1 Totala intäkter'!O14+'Blad 1 Totala intäkter'!O16+'Blad 1 Totala intäkter'!O18+'Blad 1 Totala intäkter'!O20+'Blad 1 Totala intäkter'!O22)*G82/1000","v":0},{"$f":"('Blad 1 Totala intäkter'!P14+'Blad 1 Totala intäkter'!P16+'Blad 1 Totala intäkter'!P18+'Blad 1 Totala intäkter'!P20+'Blad 1 Totala intäkter'!P22)*H82/1000","v":0},{"$f":"('Blad 1 Totala intäkter'!Q14+'Blad 1 Totala intäkter'!Q16+'Blad 1 Totala intäkter'!Q18+'Blad 1 Totala intäkter'!Q20+'Blad 1 Totala intäkter'!Q22)*I82/1000","v":0}]
["Korrigerad utbetalning",null,null,{"$f":"IF(ISERROR(((ROUND((((('Blad 3 Inkomstutjämning'!C19-'Blad 3 Inkomstutjämning'!C24/('Blad 3 Inkomstutjämning'!C21+'Blad 6 Befolkningsförändringar'!D102)*1000)*'Blad 3 Inkomstutjämning'!C$37/100))),0))+('Blad 1 Totala intäkter'!K18+'Blad 1 Totala intäkter'!K16+'Blad 1 Totala intäkter'!K20+'Blad 1 Totala intäkter'!K22))*(C82+D102)/1000),0,((ROUND((((('Blad 3 Inkomstutjämning'!C19-'Blad 3 Inkomstutjämning'!C24/('Blad 3 Inkomstutjämning'!C21+'Blad 6 Befolkningsförändringar'!D102)*1000)*'Blad 3 Inkomstutjämning'!C$37/100))),0))+('Blad 1 Totala intäkter'!K18+'Blad 1 Totala intäkter'!K16+'Blad 1 Totala intäkter'!K20+'Blad 1 Totala intäkter'!K22))*(C82+D102)/1000)","v":0},{"$f":"IF(ISERROR(((ROUND((((('Blad 3 Inkomstutjämning'!D19-'Blad 3 Inkomstutjämning'!D24/('Blad 3 Inkomstutjämning'!D21+'Blad 6 Befolkningsförändringar'!E102)*1000)*'Blad 3 Inkomstutjämning'!D$37/100))),0))+('Blad 1 Totala intäkter'!L18+'Blad 1 Totala intäkter'!L16+'Blad 1 Totala intäkter'!L20+'Blad 1 Totala intäkter'!L22))*(D82+E102)/1000),0,((ROUND((((('Blad 3 Inkomstutjämning'!D19-'Blad 3 Inkomstutjämning'!D24/('Blad 3 Inkomstutjämning'!D21+'Blad 6 Befolkningsförändringar'!E102)*1000)*'Blad 3 Inkomstutjämning'!D$37/100))),0))+('Blad 1 Totala intäkter'!L18+'Blad 1 Totala intäkter'!L16+'Blad 1 Totala intäkter'!L20+'Blad 1 Totala intäkter'!L22))*(D82+E102)/1000)","v":0},{"$f":"IF(ISERROR(((ROUND((((('Blad 3 Inkomstutjämning'!E19-'Blad 3 Inkomstutjämning'!E24/('Blad 3 Inkomstutjämning'!E21+'Blad 6 Befolkningsförändringar'!F102)*1000)*'Blad 3 Inkomstutjämning'!E$37/100))),0))+('Blad 1 Totala intäkter'!M18+'Blad 1 Totala intäkter'!M16+'Blad 1 Totala intäkter'!M20+'Blad 1 Totala intäkter'!M22))*(E82+F102)/1000),0,((ROUND((((('Blad 3 Inkomstutjämning'!E19-'Blad 3 Inkomstutjämning'!E24/('Blad 3 Inkomstutjämning'!E21+'Blad 6 Befolkningsförändringar'!F102)*1000)*'Blad 3 Inkomstutjämning'!E$37/100))),0))+('Blad 1 Totala intäkter'!M18+'Blad 1 Totala intäkter'!M16+'Blad 1 Totala intäkter'!M20+'Blad 1 Totala intäkter'!M22))*(E82+F102)/1000)","v":0},{"$f":"IF(ISERROR(((ROUND((((('Blad 3 Inkomstutjämning'!F19-'Blad 3 Inkomstutjämning'!F24/('Blad 3 Inkomstutjämning'!F21+'Blad 6 Befolkningsförändringar'!G102)*1000)*'Blad 3 Inkomstutjämning'!F$37/100))),0))+('Blad 1 Totala intäkter'!N18+'Blad 1 Totala intäkter'!N16+'Blad 1 Totala intäkter'!N20+'Blad 1 Totala intäkter'!N22))*(F82+G102)/1000),0,((ROUND((((('Blad 3 Inkomstutjämning'!F19-'Blad 3 Inkomstutjämning'!F24/('Blad 3 Inkomstutjämning'!F21+'Blad 6 Befolkningsförändringar'!G102)*1000)*'Blad 3 Inkomstutjämning'!F$37/100))),0))+('Blad 1 Totala intäkter'!N18+'Blad 1 Totala intäkter'!N16+'Blad 1 Totala intäkter'!N20+'Blad 1 Totala intäkter'!N22))*(F82+G102)/1000)","v":0},{"$f":"IF(ISERROR(((ROUND((((('Blad 3 Inkomstutjämning'!G19-'Blad 3 Inkomstutjämning'!G24/('Blad 3 Inkomstutjämning'!G21+'Blad 6 Befolkningsförändringar'!H102)*1000)*'Blad 3 Inkomstutjämning'!G$37/100))),0))+('Blad 1 Totala intäkter'!O18+'Blad 1 Totala intäkter'!O16+'Blad 1 Totala intäkter'!O20+'Blad 1 Totala intäkter'!O22))*(G82+H102)/1000),0,((ROUND((((('Blad 3 Inkomstutjämning'!G19-'Blad 3 Inkomstutjämning'!G24/('Blad 3 Inkomstutjämning'!G21+'Blad 6 Befolkningsförändringar'!H102)*1000)*'Blad 3 Inkomstutjämning'!G$37/100))),0))+('Blad 1 Totala intäkter'!O18+'Blad 1 Totala intäkter'!O16+'Blad 1 Totala intäkter'!O20+'Blad 1 Totala intäkter'!O22))*(G82+H102)/1000)","v":0},{"$f":"IF(ISERROR(((ROUND((((('Blad 3 Inkomstutjämning'!H19-'Blad 3 Inkomstutjämning'!H24/('Blad 3 Inkomstutjämning'!H21+'Blad 6 Befolkningsförändringar'!I102)*1000)*'Blad 3 Inkomstutjämning'!H$37/100))),0))+('Blad 1 Totala intäkter'!P18+'Blad 1 Totala intäkter'!P16+'Blad 1 Totala intäkter'!P20+'Blad 1 Totala intäkter'!P22))*(H82+I102)/1000),0,((ROUND((((('Blad 3 Inkomstutjämning'!H19-'Blad 3 Inkomstutjämning'!H24/('Blad 3 Inkomstutjämning'!H21+'Blad 6 Befolkningsförändringar'!I102)*1000)*'Blad 3 Inkomstutjämning'!H$37/100))),0))+('Blad 1 Totala intäkter'!P18+'Blad 1 Totala intäkter'!P16+'Blad 1 Totala intäkter'!P20+'Blad 1 Totala intäkter'!P22))*(H82+I102)/1000)","v":0},{"$f":"IF(ISERROR(((ROUND((((('Blad 3 Inkomstutjämning'!I19-'Blad 3 Inkomstutjämning'!I24/('Blad 3 Inkomstutjämning'!I21+'Blad 6 Befolkningsförändringar'!J102)*1000)*'Blad 3 Inkomstutjämning'!I$37/100))),0))+('Blad 1 Totala intäkter'!Q18+'Blad 1 Totala intäkter'!Q16+'Blad 1 Totala intäkter'!Q20+'Blad 1 Totala intäkter'!Q22))*(I82+J102)/1000),0,((ROUND((((('Blad 3 Inkomstutjämning'!I19-'Blad 3 Inkomstutjämning'!I24/('Blad 3 Inkomstutjämning'!I21+'Blad 6 Befolkningsförändringar'!J102)*1000)*'Blad 3 Inkomstutjämning'!I$37/100))),0))+('Blad 1 Totala intäkter'!Q18+'Blad 1 Totala intäkter'!Q16+'Blad 1 Totala intäkter'!Q20+'Blad 1 Totala intäkter'!Q22))*(I82+J102)/1000)","v":0}]
[]
["Ersättning per ersatt",null,null,{"$f":"IF(ISERROR(D109/D102*1000),0,(D109/D102*1000))","v":0},0,0,0,0,0,0]
[]
["Eftersläpningsersättning, tusentals kronor",null,{"$f":"+C110*'Blad 2 Indata'!B71/1000","v":0},{"$f":"D105-D104","v":0},0,0,0,0,0,0]
["Eftersläpningsersättning, kr per inv",null,{"$f":"IF(ISERROR(VLOOKUP('Blad 2 Indata'!B1,Data!A2:DH292,77)),0,(VLOOKUP('Blad 2 Indata'!B1,Data!A2:DH292,77)))","v":0},{"$f":"IF(ISERROR(D109/'Blad 2 Indata'!C71*1000),IF(ISERROR(D109/D82*1000),0,(D109/D82*1000)),(D109/'Blad 2 Indata'!C71*1000))","v":0},{"$f":"IF(ISERROR(E109/'Blad 2 Indata'!D71*1000),IF(ISERROR(E109/E82*1000),0,(E109/E82*1000)),(E109/'Blad 2 Indata'!D71*1000))","v":0},{"$f":"IF(ISERROR(F109/'Blad 2 Indata'!E71*1000),IF(ISERROR(F109/F82*1000),0,(F109/F82*1000)),(F109/'Blad 2 Indata'!E71*1000))","v":0},{"$f":"IF(ISERROR(G109/'Blad 2 Indata'!F71*1000),IF(ISERROR(G109/G82*1000),0,(G109/G82*1000)),(G109/'Blad 2 Indata'!F71*1000))","v":0},{"$f":"IF(ISERROR(H109/'Blad 2 Indata'!G71*1000),IF(ISERROR(H109/H82*1000),0,(H109/H82*1000)),(H109/'Blad 2 Indata'!G71*1000))","v":0},{"$f":"IF(ISERROR(I109/'Blad 2 Indata'!H71*1000),IF(ISERROR(I109/I82*1000),0,(I109/I82*1000)),(I109/'Blad 2 Indata'!H71*1000))","v":0},{"$f":"IF(ISERROR(J109/'Blad 2 Indata'!I71*1000),IF(ISERROR(J109/J82*1000),0,(J109/J82*1000)),(J109/'Blad 2 Indata'!I71*1000))","v":0}]

{"sheet":"Blad 7 Statsbidrag","index":10,"n_rows":44,"n_cols":10,"rows_kept":44,"cut":false,"hidden":true,"merged":[]}
[]
[]
[]
[null,null,2023,2024,2025,2026,2027,2028,2029,2030]
[null,"Totalt enligt BP 2023 cirkulär 22:40,inkl skatteväxlingar",108030.826,110899.00000000001,108684.00000000001,108812,108876.61000000002,108876.61000000002,108876.61000000002,108876.61000000002]
[null,"Tillskott i enlighet med budgetpropositionen för 20243",null,7000,7000,7000,7000,7000,7000,7000]
[null,"Regleringar enligt finansieringsprincipen"]
[null,"Skyddat boende (utg.omr. 9 avsnitt 6.7.7)",null,14.5,14.5,14.5,14.5,14.5,14.5,14.5]
[null,"Digitala och centralt rättade nationella prov (utg.omr 16 avsnitt 3.5.2)",null,112,30,-41,-41,-41,-41,-41]
[null,"Statistik om skolväsendet inkl ekonomisk redovisning (utg.omr. 16 avsnitt (3.5.2)",null,35,35,35,35,35,35,35]
[null,"Förstärkning av sfi (utg.omr. 16 avsnitt 3.5.2)",null,29,57,57,57,57,57,57]
[null,"Stärkta skolbibliotek (utg.omr. 16 avsnitt 3.5.2)",null,null,216,432,432,432,432,432]
[null,"Tidigare beslutade och förändringar av tidigare aviserade förändringar"]
[null,"Skyddat boende för våldsutsatta barn och vuxna (utg.omr. 9 avsnitt 6.6.7)",null,-10,-10,-10,-10,-10,-10,-10]
[null,"Utökad undervisningstid flyttas fram",null,-225,-900,-675,-675,-675,-675,-675]
[null,"Grundläggande behörighet yrkesprogram",null,null,null,-42,-42,-42,-42,-42]
[null,"Stärkt rätt till assistans (utg.omr. 9 avsnitt 6.6.4) ",null,null,null,-196,-196,-196,-196,-196]
[null,"Övriga ekonomiska regleringar"]
[null,"Skatteavtalet Sverige Danmark",null,42,42,42,42,42,42,42]
[null,"Pensionsgruppen",null,null,null,-1808,-1808,-1808,-1808,-1808]
[null,"Förstärkning av det förhöjda grundavdraget",null,1353,1353,1353,1353,1353,1353,1353]
[null,"Höjd jämförelseränta vid ränteförmån",null,-71,-141,-141,-141,-141,-141,-141]
[null,"Senarelagd åldersgränshöjning av förhöjt grundavdrag",null,null,null,2116,2116,2116,2116,2116]
[null,"Restpost",null,null,26,47,47,47,47,47]
[null,"Justering skatteväxling",null,-1.9725239999999999,-1.9725239999999999,-1.9725239999999999,-1.9725239999999999,-1.9725239999999999,-1.9725239999999999,-1.9725239999999999]
[null,"Totalt BP24 inkl omföringar=blad 2 rad 32",108030.826,119175.52747600002,116402.52747600002,116993.527476,117059.13747600002,117059.13747600002,117059.13747600002,117059.13747600002]
[]
[]
[]
[]
[]
[]
[]
[null,"Ev. tillskott UO 25 utanför anslaget"]
[]
[]
[]
[]
[]
[]
[null,"Summa tillskott UO25 utanför anslaget",0,0,0,0,0,0,0,0]
[]
[null,"På nedanstående länk finns bl.a. vår specificering av generella statsbidrag som omfattar alla förändringar av anslaget för kommunalekonomisk utjämning sedan BP 2009."]
[null,"https://skr.se/ekonomijuridik/ekonomi/budgetochplanering/statsbidrag/specificeringavvissastatsbidrag.31839.html"]

{"sheet":"kommunkoder","index":11,"n_rows":66,"n_cols":14,"rows_kept":66,"cut":false,"hidden":false,"merged":[]}
["Kommun ","Kkod",null,"Kommun ","Kkod",null,"Kommun ","Kkod",null,"Kommun ","Kkod",null,"Kommun ","Kkod"]
["A",null,null,"H",null,null,null,null,null,"S"]
["Ale",1440,null,"Habo",643,null,"Lidingö",186,null,"Sala",1981,null,"Uppsala",380]
["Alingsås",1489,null,"Hagfors",1783,null,"Lidköping",1494,null,"Salem",128,null,"Uppvidinge",760]
["Alvesta",764,null,"Hallsberg",1861,null,"Lilla Edet",1462,null,"Sandviken",2181,null,"V"]
["Aneby",604,null,"Hallstahammar",1961,null,"Lindesberg",1885,null,"Sigtuna",191,null,"Vadstena",584]
["Arboga",1984,null,"Halmstad",1380,null,"Linköping",580,null,"Simrishamn",1291,null,"Vaggeryd",665]
["Arjeplog",2506,null,"Hammarö",1761,null,"Ljungby",781,null,"Sjöbo",1265,null,"Valdemarsvik",563]
["Arvidsjaur",2505,null,"Haninge",136,null,"Ljusdal",2161,null,"Skara",1495,null,"Vallentuna",115]
["Arvika",1784,null,"Haparanda",2583,null,"Ljusnarsberg",1864,null,"Skellefteå",2482,null,"Vansbro",2021]
["Askersund",1882,null,"Heby",331,null,"Lomma",1262,null,"Skinnskatteberg",1904,null,"Vara",1470]
["Avesta",2084,null,"Hedemora",2083,null,"Ludvika",2085,null,"Skurup",1264,null,"Varberg",1383]
["B",null,null,"Helsingborg",1283,null,"Luleå",2580,null,"Skövde",1496,null,"Vaxholm",187]
["Bengtsfors",1460,null,"Herrljunga",1466,null,"Lund",1281,null,"Smedjebacken",2061,null,"Vellinge",1233]
["Berg",2326,null,"Hjo",1497,null,"Lycksele",2481,null,"Sollefteå",2283,null,"Vetlanda",685]
["Bjurholm",2403,null,"Hofors",2104,null,"Lysekil",1484,null,"Sollentuna",163,null,"Vilhelmina",2462]
["Bjuv",1260,null,"Huddinge",126,null,"M",null,null,"Solna",184,null,"Vimmerby",884]
["Boden",2582,null,"Hudiksvall",2184,null,"Malmö",1280,null,"Sorsele",2422,null,"Vindeln",2404]
["Bollebygd",1443,null,"Hultsfred",860,null,"Malung-Sälen",2023,null,"Sotenäs",1427,null,"Vingåker",428]
["Bollnäs",2183,null,"Hylte",1315,null,"Malå",2418,null,"Staffanstorp",1230,null,"Vårgårda",1442]
["Borgholm",885,null,"Håbo",305,null,"Mariestad",1493,null,"Stenungsund",1415,null,"Vänersborg",1487]
["Borlänge",2081,null,"Hällefors",1863,null,"Mark",1463,null,"Stockholm",180,null,"Vännäs",2460]
["Borås",1490,null,"Härjedalen",2361,null,"Markaryd",767,null,"Storfors",1760,null,"Värmdö",120]
["Botkyrka",127,null,"Härnösand",2280,null,"Mellerud",1461,null,"Storuman",2421,null,"Värnamo",683]
["Boxholm",560,null,"Härryda",1401,null,"Mjölby",586,null,"Strängnäs",486,null,"Västervik",883]
["Bromölla",1272,null,"Hässleholm",1293,null,"Mora",2062,null,"Strömstad",1486,null,"Västerås",1980]
["Bräcke",2305,null,"Höganäs",1284,null,"Motala",583,null,"Strömsund",2313,null,"Växjö",780]
["Burlöv",1231,null,"Högsby",821,null,"Mullsjö",642,null,"Sundbyberg",183,null,"Y"]
["Båstad",1278,null,"Hörby",1266,null,"Munkedal",1430,null,"Sundsvall",2281,null,"Ydre",512]
["D",null,null,"Höör",1267,null,"Munkfors",1762,null,"Sunne",1766,null,"Ystad",1286]
["Dals-Ed",1438,null,"J",null,null,"Mölndal",1481,null,"Surahammar",1907,null,"Å"]
["Danderyd",162,null,"Jokkmokk",2510,null,"Mönsterås",861,null,"Svalöv",1214,null,"Åmål",1492]
["Degerfors",1862,null,"Järfälla",123,null,"Mörbylånga",840,null,"Svedala",1263,null,"Ånge",2260]
["Dorotea",2425,null,"Jönköping",680,null,"N",null,null,"Svenljunga",1465,null,"Åre",2321]
["E",null,null,"K",null,null,"Nacka",182,null,"Säffle",1785,null,"Årjäng",1765]
["Eda",1730,null,"Kalix",2514,null,"Nora",1884,null,"Säter",2082,null,"Åsele",2463]
["Ekerö",125,null,"Kalmar",880,null,"Norberg",1962,null,"Sävsjö",684,null,"Åstorp",1277]
["Eksjö",686,null,"Karlsborg",1446,null,"Nordanstig",2132,null,"Söderhamn",2182,null,"Åtvidaberg",561]
["Emmaboda",862,null,"Karlshamn",1082,null,"Nordmaling",2401,null,"Söderköping",582,null,"Ä"]
["Enköping",381,null,"Karlskoga",1883,null,"Norrköping",581,null,"Södertälje",181,null,"Älmhult",765]
["Eskilstuna",484,null,"Karlskrona",1080,null,"Norrtälje",188,null,"Sölvesborg",1083,null,"Älvdalen",2039]
["Eslöv",1285,null,"Karlstad",1780,null,"Norsjö",2417,null,"T",null,null,"Älvkarleby",319]
["Essunga",1445,null,"Katrineholm",483,null,"Nybro",881,null,"Tanum",1435,null,"Älvsbyn",2560]
["F",null,null,"Kil",1715,null,"Nykvarn",140,null,"Tibro",1472,null,"Ängelholm",1292]
["Fagersta",1982,null,"Kinda",513,null,"Nyköping",480,null,"Tidaholm",1498,null,"Ö"]
["Falkenberg",1382,null,"Kiruna",2584,null,"Nynäshamn",192,null,"Tierp",360,null,"Öckerö",1407]
["Falköping",1499,null,"Klippan",1276,null,"Nässjö",682,null,"Timrå",2262,null,"Ödeshög",509]
["Falun",2080,null,"Knivsta",330,null,"O",null,null,"Tingsryd",763,null,"Örebro",1880]
["Filipstad",1782,null,"Kramfors",2282,null,"Ockelbo",2101,null,"Tjörn",1419,null,"Örkelljunga",1257]
["Finspång",562,null,"Kristianstad",1290,null,"Olofström",1060,null,"Tomelilla",1270,null,"Örnsköldsvik",2284]
["Flen",482,null,"Kristinehamn",1781,null,"Orsa",2034,null,"Torsby",1737,null,"Östersund",2380]
["Forshaga",1763,null,"Krokom",2309,null,"Orust",1421,null,"Torsås",834,null,"Österåker",117]
["Färgelanda",1439,null,"Kumla",1881,null,"Osby",1273,null,"Tranemo",1452,null,"Östhammar",382]
["G",null,null,"Kungsbacka",1384,null,"Oskarshamn",882,null,"Tranås",687,null,"Östra Göinge",1256]
["Gagnef",2026,null,"Kungsör",1960,null,"Ovanåker",2121,null,"Trelleborg",1287,null,"Överkalix",2513]
["Gislaved",662,null,"Kungälv",1482,null,"Oxelösund",481,null,"Trollhättan",1488,null,"Övertorneå",2518]
["Gnesta",461,null,"Kävlinge",1261,null,"P",null,null,"Trosa",488]
["Gnosjö",617,null,"Köping",1983,null,"Pajala",2521,null,"Tyresö",138]
["Gotland",980,null,"L",null,null,"Partille",1402,null,"Täby",160]
["Grums",1764,null,"Laholm",1381,null,"Perstorp",1275,null,"Töreboda",1473]
["Grästorp",1444,null,"Landskrona",1282,null,"Piteå",2581,null,"U"]
["Gullspång",1447,null,"Laxå",1860,null,"R",null,null,"Uddevalla",1485]
["Gällivare",2523,null,"Lekeberg",1814,null,"Ragunda",2303,null,"Ulricehamn",1491]
["Gävle",2180,null,"Leksand",2029,null,"Robertsfors",2409,null,"Umeå",2480]
["Göteborg",1480,null,"Lerum",1441,null,"Ronneby",1081,null,"Upplands Väsby",114]
["Götene",1471,null,"Lessebo",761,null,"Rättvik",2031,null,"Upplands-Bro",139]