{"text_format":"1","workbook":"xlsx","n_sheets":12,"sheets":["Prognosunderlag","Administration","Data","Diagram","Blad 1 Totala intäkter","Blad 2 Indata","Blad 3 Inkomstutjämning","Blad 4 Kostnadsutjämning","Blad 5 Inför.- o strukturbidrag","Blad 6 Befolkningsförändringar","Blad 7 Statsbidrag","kommunkoder"],"not_rendered":{"charts":10,"images":0,"macros":1,"external_links":0,"defined_names":34,"comments":2,"pivot_tables":0},"unopened":[],"bounds":{"document_bytes":16777216,"sheet_cells":100000,"rows_first":2000,"rows_last":500,"rows_between":2000,"halvings":0,"cell_chars":16384,"cell_head_chars":4096},"cells_cut":0,"cells_raw":0,"read":"whole","date_system":"1900"}

{"sheet":"Prognosunderlag","index":0,"n_rows":68,"n_cols":10,"rows_kept":68,"cut":false,"hidden":false,"merged":[]}
["Skatter och bidrag 2024-2031",null,{"$f":"'Blad 2 Indata'!A2","v":""},null,null,null,null,null,null,"2024-04-26"]
["24:27","Skriv in kommunens kommunkod i cellen B1"]
["Belopp i tkr",null,{"$f":"'Blad 1 Totala intäkter'!B9","v":2024},{"$f":"'Blad 1 Totala intäkter'!C9","v":2025},{"$f":"'Blad 1 Totala intäkter'!D9","v":2026},{"$f":"'Blad 1 Totala intäkter'!E9","v":2027},{"$f":"'Blad 1 Totala intäkter'!F9","v":2028},{"$f":"'Blad 1 Totala intäkter'!G9","v":2029},{"$f":"'Blad 1 Totala intäkter'!H9","v":2030},{"$f":"'Blad 1 Totala intäkter'!I9","v":2031}]
["Skatteintäkter",null,{"$f":"'Blad 1 Totala intäkter'!B12","v":0},{"$f":"'Blad 1 Totala intäkter'!C12","v":0},{"$f":"'Blad 1 Totala intäkter'!D12","v":0},{"$f":"'Blad 1 Totala intäkter'!E12","v":0},{"$f":"'Blad 1 Totala intäkter'!F12","v":0},{"$f":"'Blad 1 Totala intäkter'!G12","v":0},{"$f":"'Blad 1 Totala intäkter'!H12","v":0},{"$f":"'Blad 1 Totala intäkter'!I12","v":0}]
["Inkomstutjämningsbidrag/-avgift",null,{"$f":"'Blad 1 Totala intäkter'!B14","v":0},{"$f":"'Blad 1 Totala intäkter'!C14","v":0},{"$f":"'Blad 1 Totala intäkter'!D14","v":0},{"$f":"'Blad 1 Totala intäkter'!E14","v":0},{"$f":"'Blad 1 Totala intäkter'!F14","v":0},{"$f":"'Blad 1 Totala intäkter'!G14","v":0},{"$f":"'Blad 1 Totala intäkter'!H14","v":0},{"$f":"'Blad 1 Totala intäkter'!I14","v":0}]
["Kostnadsutjämning",null,{"$f":"'Blad 1 Totala intäkter'!B16","v":0},{"$f":"'Blad 1 Totala intäkter'!C16","v":0},{"$f":"'Blad 1 Totala intäkter'!D16","v":0},{"$f":"'Blad 1 Totala intäkter'!E16","v":0},{"$f":"'Blad 1 Totala intäkter'!F16","v":0},{"$f":"'Blad 1 Totala intäkter'!G16","v":0},{"$f":"'Blad 1 Totala intäkter'!H16","v":0},{"$f":"'Blad 1 Totala intäkter'!I16","v":0}]
["Regleringsbidrag/-avgift",null,{"$f":"'Blad 1 Totala intäkter'!B18","v":0},{"$f":"'Blad 1 Totala intäkter'!C18","v":0},{"$f":"'Blad 1 Totala intäkter'!D18","v":0},{"$f":"'Blad 1 Totala intäkter'!E18","v":0},{"$f":"'Blad 1 Totala intäkter'!F18","v":0},{"$f":"'Blad 1 Totala intäkter'!G18","v":0},{"$f":"'Blad 1 Totala intäkter'!H18","v":0},{"$f":"'Blad 1 Totala intäkter'!I18","v":0}]
["Strukturbidrag",null,{"$f":"'Blad 1 Totala intäkter'!B20","v":0},{"$f":"'Blad 1 Totala intäkter'!C20","v":0},{"$f":"'Blad 1 Totala intäkter'!D20","v":0},{"$f":"'Blad 1 Totala intäkter'!E20","v":0},{"$f":"'Blad 1 Totala intäkter'!F20","v":0},{"$f":"'Blad 1 Totala intäkter'!G20","v":0},{"$f":"'Blad 1 Totala intäkter'!H20","v":0},{"$f":"'Blad 1 Totala intäkter'!I20","v":0}]
{"$rows_left_out":61}
{"sheet":"Administration","index":1,"n_rows":31,"n_cols":3,"rows_kept":31,"cut":false,"hidden":true,"merged":[]}
[]
["Datum för senaste dataöverföring"]
["2024-04-26T10:03:41"]
["Finlnamn senaste överföringen"]
["G:\\Avd ekonomi & styrning\\EkAnalys\\Gemens_kataloger_EkAnalys\\Finspec\\Modellen Skatter och bidrag\\2024\\Kommuner\\Uppdateringsfiler\\Uppdateringsfil-24027nr2.xlsm"]
[]
["Från cirkulär","Datum","Denna lista fylls på automatiskt varje gång du uppdaterar"]
["00:00","2024-01-17","Data"]
{"$rows_left_out":24}
{"sheet":"Data","index":2,"n_rows":294,"n_cols":137,"rows_kept":294,"cut":false,"hidden":true,"merged":[]}
[1,2,3,4,5,6,7,8,9,10,11,12,13,14,15,16,17,18,19,20,21,22,23,24,25,26,27,28,29,30,31,32,33,34,35,36,37,38,39,40,41,42,43,44,45,46,47,48,49,50,51,52,53,54,55,56,57,58,59,60,61,62,63,64,65,66,67,68,69,70,71,72,73,74,75,76,77,78,79,80,81,82,83,84,85,86,87,88,89,90,91,92,93,94,95,96,97,98,99,100,101,102,103,104,105,106,107,108,109,110,111,112,113,114,115,116,117,118,119,120,121,122,123,124,125,126,127,128,129,130,131,132,133,134,135,136,137]
["Kommunkod","Kommun","Beskattningsutfall inkomstår 22","Beskattningsutfall inkomstår 23","Inv 1 november 22","Inv 1 november 23","Inv 1 november 24","Inv 1 november 25","Inv 1 november 26","Inv 1 november 27","Utdeb 23","Utdeb 24","Utdeb 25","Länsvis utdeb 95% 2024","Länsvis utdeb 85% 2024",null,"Kostnadsutjämning 24","Kostnadsutjämning 25","LSS-utjämning 24","LSS-utjämning 25","Totalt 31 dec 2022 (1 januari 23)","Totalt 31 dec 2023 (1 januari 24)","1-5 år 23 (=31 dec 2022)","6-12 år 23 (=31 dec 2022)","6 år 23 (=31 dec 2022)","7-15 år 23 (=31 dec 2022)","16-18 år 23 (=31 dec 2022)","65-79 år 23 (=31 dec 2022)","80-89 år 23 (=31 dec 2022)","90- år 23 (=31 dec 2022)","1-5 år 24 (=31 dec 2023)","6-12 år 24 (=31 dec 2023)","6 år 24 (=31 dec 2023)","7-15 år 24 (=31 dec 2023)","16-18 år 24 (=31 dec 2023)","65-79 år 24 (=31 dec 2023)","80-89 år 24 (=31 dec 2023)","90- år 24 (=31 dec 2023)","Totalt 31 dec 12","Totalt 31 dec 13","Totalt 31 dec 14","Totalt 31 dec 15","Totalt 31 dec 16","Totalt 31 dec 17","Totalt 31 dec 17","Totalt 31 dec 18","Totalt 31 dec 19","Totalt 31 dec 20","Totalt 31 dec 21","Totalt 31 dec 22","6-15 år 31 dec 17","6-15 år 31 dec 18","6-15 år 31 dec 19","6-15 år 31 dec 20","6-15 år 31 dec 21","6-15 år 31 dec 22","1-5 år 31 dec 2017","1-5 år 31 dec 2018","1-5 år 31 dec 2019","1-5 år 31 dec 2020","1-5 år 31 dec 2021","1-5 år 31 dec 2022","Inv 1 november 18","Inv 1 november 19","Inv 1 november 20","Inv 1 november 21","Inv 1 november 22","Kolumnerna till höger är prislapparna i kostutj","1-5 år 24","6-12 år 24","6 år 24","7-15 år 24","16-18 år 24","65-79 år 24","80-89 år 24","90- år 24","Eftersläpningsersättning 2024","1-5 år prel 25","6-12 år prel 25","6 år prel 25","7-15 år prel 25","16-18 år prel 25","65-79 år prel 25","80-89 år prel 25","90- år prel 25","Länsvis utdeb 95% 2025","Länsvis utdeb 85% 2025","Fastighetsavgift 09-23 prognos ökn tkr","Fastighetsavgift 24 prognos ökning tkr","Fastighetsavgift 25 prognos ökning tkr","Fastighetsavgift 26 prognos ökning tkr","Inv 1 november 07","16-18 år 31 dec 17","16-18 år 31 dec 18","16-18 år 31 dec 19","16-18 år 31 dec 20","16-18 år 31 dec 21","16-18 år 31 dec 22",null,"strukturbidrag","Kostnadsutjämn ev nytt införandebidrag 2023","Kostnadsutjämn ev nytt införandebidrag 2024","Kostnadsutjämn ev nytt införandebidrag 2025","Kostnadsutjämn ev nytt införandebidrag 2026","Kostnadsutjämn ev nytt införandebidrag 2027","Kostnadsutjämn ev nytt införandebidrag 2028","Kostnadsutjämn ev nytt införandebidrag 2029","Justering anslag 2023 vid värdesäkring se cell DE109"]
[114,"Upplands Väsby",12197331.6,null,48973,50209,50333,50450,50563,50670,19.420000000000002,19.420000000000002,null,19.05,16.98,null,2574,2212,-43.2636356347139,-292.64756408683388,49262,50110,3184,4538,680,5685,1746,5853,1880,315,3121,4666,696,5814,1846,5805,2040,341,40723,41449,41816,42661,43891,44605,44605,45543,46786,47184,47820,49262,5538,5684,5847,6075,6184,6365,2973,3066,3148,3086,3046,3184,45332,46510,47194,47573,48973,null,146631.59947843483,23105.115202700479,70361.734488949602,127911.92580598241,133585.2276004875,24725.826059999999,131565.17009999999,339935.74705999997,814,152752.09390623562,23441.083498308239,72514.658813731643,130841.65448945508,133162.94606697545,25042.055768999995,132662.56703399998,342156.2835689999,19.05,16.98,28066.377349268525,1959.5360000000001,3857.942,null,38027,1515,1588,1645,1645,1714,1746,null,0,0]
[115,"Vallentuna",9925039.8000000007,null,34760,35078,35164,35246,35325,35400,18.899999999999999,18.899999999999999,null,19.05,16.98,null,2014,1441,-141.93700474501,-242.05272796698773,34851,35076,2053,3655,469,4731,1520,4033,1359,230,1981,3533,455,4661,1520,4022,1498,215,31215,31616,31969,32380,32785,33175,33175,33432,34090,34119,34246,34851,4998,5070,5196,5183,5179,5200,2362,2268,2238,2139,2056,2053,33280,34040,34127,34256,34760,null,144425.89046459814,24829.214037235284,71191.629317186162,126318.35473190869,133985.79748288248,22758.689719999998,125086.79247999999,335587.79877999995,0,150389.96630446895,25186.416812732066,73342.558238368467,128757.73055040509,133658.12931231083,23044.256900999993,126090.80558099996,336392.36386199994,19.05,16.98,38424.901375351365,2849.701,4365.6509999999998,null,28249,1239,1326,1380,1437,1470,1520,null,0,0]
[117,"Österåker",14036812.800000001,null,49070,49395,49517,49632,49743,49848,16.899999999999999,16.600000000000001,null,19.05,16.98,null,1169,1358,-743.51773075397796,-814.55245589729384,49138,49282,3111,4612,669,5918,2098,6655,1993,336,3048,4570,641,5907,2056,6552,2226,347,40269,40495,41180,42130,43293,44130,44130,44831,45574,46644,48234,49138,6405,6456,6362,6393,6504,6587,2799,2825,2826,2855,3066,3111,44663,45424,46585,48008,49070,null,143765.57480104381,24017.969798437996,72322.888123733181,128390.83779201408,132962.7302821656,22107.694959999997,125016.03217999999,325818.52289999998,0,149871.89327423021,24369.217586566836,74519.0131039064,130968.46158742593,132462.95516307381,22440.971483999994,125921.55338999997,334338.49371599994,19.05,16.98,68916.816114864851,5495.4579999999996,8495.0969999999998,null,38257,1608,1773,1877,1997,2073,2098,null,0,0]
[120,"Värmdö",13665608.800000001,null,46351,46571,46686,46795,46900,46999,18.98,18.98,null,19.05,16.98,null,94,287,-1558.9884268000901,-1370.6295180767102,46457,46637,2763,4404,646,5673,1961,6526,1614,280,2695,4354,605,5619,2014,6621,1809,307,39387,39784,40541,41107,42000,43444,43444,44397,45000,45566,46232,46457,6396,6439,6399,6396,6396,6319,2895,2888,2859,2775,2835,2763,44210,44928,45393,46174,46351,null,143261.75952155003,24270.743182961083,72118.847191224209,126944.20599079845,135361.16475903513,23231.150799999999,129378.13251999998,343019.80751999997,0,149308.16801638436,24624.261632538182,74301.920570499613,129504.26692318123,134305.43513568855,23576.934041999993,127417.82582699996,337332.07694699994,19.05,16.98,96686.697556298823,7729.1480000000001,12210.049000000001,null,36672,1611,1720,1851,1920,1902,1961,null,0,0]
[123,"Järfälla",21729867.100000001,null,84962,86143,86355,86556,86750,86933,18.989999999999998,19.239999999999998,null,19.05,16.98,null,1447,1486,-767.98787402370999,-977.0297633604805,85460,86330,5342,7644,1101,9746,3214,9702,3288,648,5336,7614,1076,9817,3236,9676,3478,673,68210,69167,70701,72429,74412,76453,76453,78480,79990,81274,83170,85460,9894,10135,10389,10481,10727,10847,5106,5271,5211,5339,5331,5342,78070,79907,81034,82841,84962,null,146033.6204368727,23873.66105995416,69991.681323247351,127302.4621596147,133384.01770431467,24326.302519999997,129031.95135999999,337656.17677999998,117,152338.44776672142,24225.504347962855,72122.325785202454,130098.54997411587,131487.94255681112,24664.093820999995,129603.56731199997,341418.01174199994,19.05,16.98,49324.073986480653,3363.1970000000001,6678.6689999999999,null,63229,2674,2785,2903,2984,3068,3214,null,0,0]
[125,"Ekerö",9209881.3000000007,null,29135,28866,28937,29004,29069,29130,18.95,19.22,null,19.05,16.98,null,4822,5425,768.29770640268498,853.28351163363914,29123,28808,1811,3198,437,4256,1319,3718,1205,203,1727,3119,423,4153,1396,3760,1311,207,26160,26355,26698,26984,27406,27753,27753,28308,28690,28879,29096,29123,4588,4651,4670,4713,4726,4693,1924,1918,1880,1860,1856,1811,28232,28594,28861,29059,29135,null,144693.74677010911,24811.438896742933,72270.417674132608,127875.92587425483,134006.96182305057,21624.347679999999,122204.12671999999,335761.97797999997,0,150733.24325413763,25170.912433451453,74463.760455606011,130485.34148015374,134387.26832973809,21951.905336999997,123546.83093099997,335296.89722699992,19.05,16.98,43616.959407391616,3016.107,4957.6970000000001,null,24634,1052,1169,1262,1280,1307,1319,null,0,0]
{"$rows_left_out":287}
{"sheet":"Diagram","index":3,"n_rows":0,"n_cols":0,"rows_kept":0,"cut":false,"hidden":true,"merged":[]}

{"sheet":"Blad 1 Totala intäkter","index":4,"n_rows":40,"n_cols":18,"rows_kept":40,"cut":false,"hidden":true,"merged":[]}
["Totala intäkter",{"$f":"'Blad 2 Indata'!A2","v":""}]
[{"$f":"TODAY()","v":"2024-04-26"},null,null,{"$f":"IF('Blad 2 Indata'!B1>0,(IF(('Blad 6 Befolkningsförändringar'!D110+'Blad 6 Befolkningsförändringar'!E110+'Blad 6 Befolkningsförändringar'!F110+'Blad 6 Befolkningsförändringar'!G110)>0,IF('Blad 2 Indata'!P5<3,\"Din befolkningsprognos ger ersättning för eftersläpningseffekter som ej ingår i resultatet nedan. Se textrutan blad 6, rad 112 för mer info\",\" \"),\" \")),\" \")","v":" "}]
["Rikets skatteunderlag","Eget skatteunderlag",null,"Antal invånare",null,"Kostnadsutjämning",null,"Skattesats",null,"Statsbidrag",null,"Fastighetsavgift"]
[{"$f":"IF('Blad 2 Indata'!$L$3=1,\"SKR\",\"Egen prognos\")","v":"SKR"},{"$f":"IF('Blad 2 Indata'!$N$3=1,\"Riksprognos\",\"Egen prognos\")","v":"Riksprognos"},null,{"$f":"IF('Blad 2 Indata'!$O$3=1,\"Riksprognos\",\"Egen prognos\")","v":"Riksprognos"},null,{"$f":"IF('Blad 2 Indata'!$P$5=1,\"Senaste utfall utan pris\",IF('Blad 2 Indata'!$P$5=2,\"Senaste utfall med pris\",IF('Blad 2 Indata'!$P$5=3,\"Demografi utan pris\",\"Demografi med pris\")))","v":"Senaste utfall utan pris"}]
[]
[]
[{"$f":"IF(AND('Blad 2 Indata'!T3=2,SUM('Blad 2 Indata'!D59:F59)<>0),\"Förändrad skattesats, %\",\" \")","v":" "},null,{"$f":"IF(AND('Blad 2 Indata'!$T$3=2,'Blad 2 Indata'!D59<>0),'Blad 2 Indata'!D59,\" \")","v":" "},{"$f":"IF(AND('Blad 2 Indata'!$T$3=2,'Blad 2 Indata'!E59<>0),'Blad 2 Indata'!E59,\" \")","v":" "},{"$f":"IF(AND('Blad 2 Indata'!$T$3=2,'Blad 2 Indata'!F59<>0),'Blad 2 Indata'!F59,\" \")","v":" "},{"$f":"IF(AND('Blad 2 Indata'!$T$3=2,'Blad 2 Indata'!G59<>0),'Blad 2 Indata'!G59,\" \")","v":" "},{"$f":"IF(AND('Blad 2 Indata'!$T$3=2,'Blad 2 Indata'!H59<>0),'Blad 2 Indata'!H59,\" \")","v":" "},{"$f":"IF(AND('Blad 2 Indata'!$T$3=2,'Blad 2 Indata'!I59<>0),'Blad 2 Indata'!I59,\" \")","v":" "},{"$f":"IF(AND('Blad 2 Indata'!$T$3=2,'Blad 2 Indata'!J59<>0),'Blad 2 Indata'!J59,\" \")","v":" "}]
[]
{"$rows_left_out":33}
{"sheet":"Blad 2 Indata","index":5,"n_rows":112,"n_cols":24,"rows_kept":112,"cut":false,"hidden":true,"merged":[]}
[null,{"$f":"Prognosunderlag!B1","v":0},{"$f":"IF(B1>0,\" \",\"Skriv in kommunens kommunkod i cellen B1\")","v":"Skriv in kommunens kommunkod i cellen B1"},null,null,null,null,null,null,null,null,"SKR",null,"Riksprognos",null,"Senaste utfall utan pris",null,"Oförändrat",null,"Oförändrad",null,"Ej värdesäkrat",null,"Med fastighetavgift nominellt oförändrad"]
[{"$f":"IF(ISERROR(VLOOKUP(B1,Data!A2:AZ292,2)),\"\",(VLOOKUP(B1,Data!A2:AZ292,2)))","v":""},null,null,null,null,null,null,null,null,null,null,"Egen prognos",null,"Egen prognos",null,"Senaste utfall med pris",null,"Egen prognos",null,"Förändrad",null,"Värdesäkrat",null,"Utan fastighetsavgift"]
[null,{"$f":"'Blad 1 Totala intäkter'!B9-1","v":2023},{"$f":"B3+1","v":2024},2025,2026,2027,2028,2029,{"$f":"H3+1","v":2030},{"$f":"I3+1","v":2031},null,1,null,1,1,"Demografi utan pris",null,1,null,1,null,1,null,"Egen prognos"]
[null,null,null,null,null,null,null,null,null,null,null,null,null,null,null,"Demografi med pris",null,null,null,null,null,null,null,1]
["Uppräkningsfaktorer",null,null,null,null,null,null,null,null,null,null,null,null,null,null,1]
["Rikets skatteunderlag, %"]
[{"$f":"\"Fastställt för \"&C3","v":"Fastställt för 2024"},4.5999999999999996,3.3,null," "]
[{"$f":"\"Fastställt för \"&D3","v":"Fastställt för 2025"}]
{"$rows_left_out":105}
{"sheet":"Blad 3 Inkomstutjämning","index":6,"n_rows":51,"n_cols":10,"rows_kept":51,"cut":false,"hidden":true,"merged":[]}
["Inkomstutjämning",null,null,"Rikets skatteunderlag",null,{"$f":"IF('Blad 2 Indata'!$L$3=1,\"Kommunförbundet\",\"Egen prognos\")","v":"Kommunförbundet"}]
[]
["Kommunens skatte-",null,null,"Eget skatteunderlag",null,{"$f":"IF('Blad 2 Indata'!$N$3=1,\"Riksprognos\",\"Egen prognos\")","v":"Riksprognos"}]
["underlag inkomståret 2022, tkr",{"$f":"'Blad 2 Indata'!B20","v":0}]
[null,null,null,"Antal invånare",null,{"$f":"IF('Blad 2 Indata'!$O$3=1,\"Riksprognos\",\"Egen prognos\")","v":"Riksprognos"}]
[]
[null,{"$f":"'Blad 1 Totala intäkter'!B9-1","v":2023},{"$f":"B7+1","v":2024},2025,2026,2027,2028,2029,2030,2031]
[]
{"$rows_left_out":44}
{"sheet":"Blad 4 Kostnadsutjämning","index":7,"n_rows":79,"n_cols":9,"rows_kept":79,"cut":false,"hidden":true,"merged":[]}
["Kostnadsutjämning",null,{"$f":"IF('Blad 2 Indata'!$P$5=1,\"Senaste utfall utan pris\",IF('Blad 2 Indata'!$P$5=2,\"Senaste utfall med pris\",IF('Blad 2 Indata'!$P$5=3,\"Demografi utan pris\",\"Demografi med pris\")))","v":"Senaste utfall utan pris"}]
["Kronor per invånare"]
[]
[]
[null,{"$f":"'Blad 1 Totala intäkter'!B9","v":2024},{"$f":"B5+1","v":2025},2026,2027,2028,2029,2030,2031]
["Bidrag/avgift totalt",{"$f":"'Blad 2 Indata'!C65","v":0},{"$f":"IF('Blad 2 Indata'!D65=0,IF('Blad 2 Indata'!$P$5=2,('Blad 2 Indata'!C65-'Blad 6 Befolkningsförändringar'!C110)*(1+(C8/100)),IF('Blad 2 Indata'!$P$5=3,B6+(C17),IF('Blad 2 Indata'!$P$5=4,((B6+C11+C12+C13+C14)*(1+(C8/100)))+C15,'Blad 2 Indata'!C65-'Blad 6 Befolkningsförändringar'!C110))),'Blad 2 Indata'!D65)","v":0},{"$f":"IF('Blad 2 Indata'!E65=0,IF('Blad 2 Indata'!$P$5=2,C6*(1+(D8/100)),IF('Blad 2 Indata'!$P$5=3,C6+(D17),IF('Blad 2 Indata'!$P$5=4,((C6+D11+D12+D13+D14)*(1+D8/100))+D15,C6))),'Blad 2 Indata'!D65)","v":0},{"$f":"IF('Blad 2 Indata'!F65=0,IF('Blad 2 Indata'!$P$5=2,D6*(1+(E8/100)),IF('Blad 2 Indata'!$P$5=3,D6+(E17),IF('Blad 2 Indata'!$P$5=4,((D6+E11+E12+E13+E14)*(1+E8/100))+E15,D6))),'Blad 2 Indata'!E65)","v":0},{"$f":"IF('Blad 2 Indata'!G65=0,IF('Blad 2 Indata'!$P$5=2,E6*(1+(F8/100)),IF('Blad 2 Indata'!$P$5=3,E6+(F17),IF('Blad 2 Indata'!$P$5=4,((E6+F11+F12+F13+F14)*(1+F8/100))+F15,E6))),'Blad 2 Indata'!F65)","v":0},{"$f":"IF('Blad 2 Indata'!H65=0,IF('Blad 2 Indata'!$P$5=2,F6*(1+(G8/100)),IF('Blad 2 Indata'!$P$5=3,F6+(G17),IF('Blad 2 Indata'!$P$5=4,((F6+G11+G12+G13+G14)*(1+G8/100))+G15,F6))),'Blad 2 Indata'!G65)","v":0},{"$f":"IF('Blad 2 Indata'!I65=0,IF('Blad 2 Indata'!$P$5=2,G6*(1+(H8/100)),IF('Blad 2 Indata'!$P$5=3,G6+(H17),IF('Blad 2 Indata'!$P$5=4,((G6+H11+H12+H13+H14)*(1+H8/100))+H15,G6))),'Blad 2 Indata'!H65)","v":0},{"$f":"IF('Blad 2 Indata'!J65=0,IF('Blad 2 Indata'!$P$5=2,H6*(1+(I8/100)),IF('Blad 2 Indata'!$P$5=3,H6+(I17),IF('Blad 2 Indata'!$P$5=4,((H6+I11+I12+I13+I14)*(1+I8/100))+I15,H6))),'Blad 2 Indata'!I65)","v":0}]
[]
["Kpi, procent",null,{"$f":"'Blad 2 Indata'!D56","v":0.4488786213272089},{"$f":"'Blad 2 Indata'!E56","v":1.6619440856880718},{"$f":"'Blad 2 Indata'!F56","v":2.1080328909825363},{"$f":"'Blad 2 Indata'!G56","v":2.1727128377435401},{"$f":"'Blad 2 Indata'!H56","v":2.1384508973766758},{"$f":"'Blad 2 Indata'!I56","v":2.0995805511258014},{"$f":"'Blad 2 Indata'!J56","v":2.0995805511258014}]
{"$rows_left_out":72}
{"sheet":"Blad 5 Inför.- o strukturbidrag","index":8,"n_rows":21,"n_cols":12,"rows_kept":21,"cut":false,"hidden":true,"merged":[]}
["Införande- och strukturbidrag",{"$f":"'Blad 2 Indata'!B1","v":0}]
["Kronor per invånare"]
[]
[null,null,null,null,{"$f":"'Blad 1 Totala intäkter'!B9","v":2024},{"$f":"E4+1","v":2025},{"$f":"F4+1","v":2026},2027,2028,2029,2030,2031]
[]
[]
[]
["Strukturbidrag 2013 kr/inv",null,{"$f":"ROUND(IF(ISERROR(VLOOKUP('Blad 2 Indata'!B$1,Data!A$2:DH$292,93)),0,(VLOOKUP('Blad 2 Indata'!B$1,Data!A$2:DH$292,93))),0)","v":0}]
{"$rows_left_out":14}
{"sheet":"Blad 6 Befolkningsförändringar","index":9,"n_rows":110,"n_cols":10,"rows_kept":110,"cut":false,"hidden":true,"merged":[]}
["Befolkningsförändringar"]
["Kronor per invånare"]
[null,{"$f":"'Blad 1 Totala intäkter'!B9-1","v":2023},{"$f":"B3+1","v":2024},2025,2026,2027,2028,2029,2030,2031]
[]
["Ersättning för förändring av totalfolkmängd"]
["Totalt",null,{"$f":"'Blad 2 Indata'!B71","v":0},{"$f":"IF('Blad 2 Indata'!C71<>0,'Blad 2 Indata'!C71,0)","v":0},{"$f":"IF('Blad 2 Indata'!D71<>0,'Blad 2 Indata'!D71,0)","v":0},{"$f":"IF('Blad 2 Indata'!E71<>0,'Blad 2 Indata'!E71,0)","v":0},{"$f":"IF('Blad 2 Indata'!F71<>0,'Blad 2 Indata'!F71,0)","v":0},{"$f":"IF('Blad 2 Indata'!G71<>0,'Blad 2 Indata'!G71,0)","v":0},{"$f":"IF('Blad 2 Indata'!H71<>0,'Blad 2 Indata'!H71,0)","v":0},{"$f":"IF('Blad 2 Indata'!I71<>0,'Blad 2 Indata'!I71,0)","v":0}]
["Totalt, 10 år innan",null,{"$f":"'Blad 2 Indata'!B81","v":0},{"$f":"IF(D6<>0,'Blad 2 Indata'!C81,0)","v":0},{"$f":"IF(E6<>0,'Blad 2 Indata'!D81,0)","v":0},{"$f":"IF(F6<>0,'Blad 2 Indata'!E81,0)","v":0},{"$f":"IF(G6<>0,'Blad 2 Indata'!F81,0)","v":0},{"$f":"IF(H6<>0,'Blad 2 Indata'!G81,0)","v":0},{"$f":"IF(I6<>0,'Blad 2 Indata'!H81,0)","v":0},{"$f":"IF(J6<>0,'Blad 2 Indata'!I81,0)","v":0}]
["Förändring, procent",null,{"$f":"IF(C6<>0,(C6/C7-1)*100,0)","v":0},{"$f":"IF(D6<>0,(D6/D7-1)*100,0)","v":0},0,0,0,0,0,0]
{"$rows_left_out":103}
{"sheet":"Blad 7 Statsbidrag","index":10,"n_rows":44,"n_cols":10,"rows_kept":44,"cut":false,"hidden":true,"merged":[]}
[]
[]
[]
[null,null,2023,2024,2025,2026,2027,2028,2029,2030]
[null,"Totalt enligt BP 2023 cirkulär 22:40,inkl skatteväxlingar",108030.826,110899.00000000001,108684.00000000001,108812,108876.61000000002,108876.61000000002,108876.61000000002,108876.61000000002]
[null,"Tillskott i enlighet med budgetpropositionen för 20243",null,7000,7000,7000,7000,7000,7000,7000]
[null,"Regleringar enligt finansieringsprincipen"]
[null,"Skyddat boende (utg.omr. 9 avsnitt 6.7.7)",null,14.5,14.5,14.5,14.5,14.5,14.5,14.5]
{"$rows_left_out":37}
{"sheet":"kommunkoder","index":11,"n_rows":66,"n_cols":14,"rows_kept":66,"cut":false,"hidden":false,"merged":[]}
["Kommun ","Kkod",null,"Kommun ","Kkod",null,"Kommun ","Kkod",null,"Kommun ","Kkod",null,"Kommun ","Kkod"]
["A",null,null,"H",null,null,null,null,null,"S"]
["Ale",1440,null,"Habo",643,null,"Lidingö",186,null,"Sala",1981,null,"Uppsala",380]
["Alingsås",1489,null,"Hagfors",1783,null,"Lidköping",1494,null,"Salem",128,null,"Uppvidinge",760]
["Alvesta",764,null,"Hallsberg",1861,null,"Lilla Edet",1462,null,"Sandviken",2181,null,"V"]
["Aneby",604,null,"Hallstahammar",1961,null,"Lindesberg",1885,null,"Sigtuna",191,null,"Vadstena",584]
["Arboga",1984,null,"Halmstad",1380,null,"Linköping",580,null,"Simrishamn",1291,null,"Vaggeryd",665]
["Arjeplog",2506,null,"Hammarö",1761,null,"Ljungby",781,null,"Sjöbo",1265,null,"Valdemarsvik",563]
{"$rows_left_out":58}